program: Orca
programVersion: 5.0.2
elementType: O O C C C C C C C C C C C C C C C C C H H H H H H H H H H H H H H H H H H H H H H H H H H H H H H
charge: 0
multiplicity: 1
keywords: wb97x-d3
keywords: def2-TZVPP
keywords: def2/J RIJCOSX
keywords: DEFGRID2
keywords: scfconv7
keywords: smallprint printgap noloewdin
keywords: NOSOSCF
formula: C17H30O2
InChI: InChI=1/C17H30O2/c1-6-19-17(18)13-16(5)12-8-11-15(4)10-7-9-14(2)3/h8,12-15H,6-7,9-11H2,1-5H3
49 atoms
O  4.048809 -2.040558 1.456457
O  3.859274 -1.533812 -0.713648
C  -3.67334 0.006264 0.150219
C  -2.991929 1.087018 0.992307
C  -3.383741 2.523783 0.653376
C  -3.090096 2.949059 -0.78547
C  -1.651341 2.736621 -1.264959
C  -2.963472 -1.346232 0.324489
C  -5.154954 -0.121637 0.484738
C  -1.512514 3.17554 -2.719599
C  -0.636478 3.463138 -0.389495
C  -1.595163 -1.342077 -0.267974
C  -0.461133 -1.521739 0.413433
C  0.884708 -1.482611 -0.154491
C  1.011447 -1.1672 -1.612383
C  1.911188 -1.726039 0.683711
C  3.345392 -1.742672 0.356895
C  5.469215 -2.100995 1.344483
C  6.112667 -0.731196 1.40831
H  -3.590061 0.277982 -0.909094
H  -1.906991 0.98507 0.901765
H  -3.215924 0.896536 2.048096
H  -2.863116 3.192281 1.344356
H  -4.448072 2.680585 0.850892
H  -3.76632 2.423903 -1.468174
H  -3.340383 4.010806 -0.891324
H  -1.424747 1.66384 -1.220589
H  -3.560798 -2.122149 -0.167374
H  -2.922125 -1.611221 1.385711
H  -5.296633 -0.427814 1.523817
H  -5.684902 0.821144 0.346273
H  -5.643444 -0.864464 -0.147962
H  -2.215113 2.647639 -3.36688
H  -0.507404 2.984996 -3.099219
H  -1.707285 4.245172 -2.827689
H  -0.645225 3.101443 0.639247
H  0.377511 3.328064 -0.769053
H  -0.838252 4.536844 -0.365039
H  -1.553126 -1.152641 -1.337105
H  -0.524662 -1.712501 1.481161
H  0.553771 -0.198832 -1.826314
H  0.474922 -1.909826 -2.206097
H  2.040769 -1.142263 -1.946427
H  1.680371 -1.939798 1.72086
H  5.75734 -2.619792 0.428345
H  5.78649 -2.710582 2.190517
H  5.844901 -0.120529 0.548049
H  5.825475 -0.201313 2.316558
H  7.197987 -0.838954 1.415349
totalener: -816.41238157 hartree
nucrepener: 1450.65980655 hartree
electener: -2267.07218812 hartree
oneelecener: -3986.32376616 hartree
twoeener: 1719.25157804 hartree
kineticenergy: 812.47244933 hartree
xcener: -82.315465691767 hartree
chargesum: -0.0000000
charge: -0.272231 -0.403306 0.021013 -0.141469 -0.187242 -0.164783 0.080394 -0.116302 -0.276933 -0.260519 -0.272319 -0.135328 -0.090700 0.043025 -0.261718 -0.160703 0.416410 0.030859 -0.255560 0.041974 0.078915 0.079466 0.082265 0.078004 0.072364 0.078546 -0.019641 0.088698 0.072071 0.079634 0.086936 0.084340 0.080351 0.084247 0.079531 0.079855 0.087769 0.083170 0.095024 0.077413 0.083649 0.091639 0.126283 0.093783 0.084087 0.094635 0.099756 0.082489 0.080162
qa: -0.2722 -0.4033 0.0210 -0.1415 -0.1872 -0.1648 0.0804 -0.1163 -0.2769 -0.2605 -0.2723 -0.1353 -0.0907 0.0430 -0.2617 -0.1607 0.4164 0.0309 -0.2556 0.0420 0.0789 0.0795 0.0823 0.0780 0.0724 0.0785 -0.0196 0.0887 0.0721 0.0796 0.0869 0.0843 0.0804 0.0842 0.0795 0.0799 0.0878 0.0832 0.0950 0.0774 0.0836 0.0916 0.1263 0.0938 0.0841 0.0946 0.0998 0.0825 0.0802
va: 2.1285 2.0944 3.7884 3.8463 3.9285 3.8823 3.8362 3.9205 3.9597 3.9286 3.9411 3.8790 3.9010 3.6703 3.9218 3.8101 4.2227 3.8830 3.9123 1.0195 1.0046 1.0156 1.0041 1.0089 1.0053 1.0138 1.0220 1.0084 1.0191 1.0045 1.0059 1.0075 1.0069 1.0079 1.0075 1.0057 1.0089 1.0053 1.0095 1.0299 0.9946 0.9976 1.0405 1.0368 1.0131 0.9942 1.0131 1.0052 1.0102
dispcorr: -0.021660619 hartree
energy: -816.434042188094
dipole: -19.34658 18.76813 -0.57846 17.77162 -17.71996 0.05166 -3.59353 4.00503 0.41149
magnitude: 0.71176 au
magnitude: 1.80916 debye
