program: Orca
programVersion: 5.0.2
elementType: O O C C C C C C C C C C C C C C C C C H H H H H H H H H H H H H H H H H H H H H H H H H H H H H H
charge: 0
multiplicity: 1
keywords: wb97x-d3
keywords: def2-TZVPP
keywords: def2/J RIJCOSX
keywords: DEFGRID2
keywords: scfconv7
keywords: smallprint printgap noloewdin
keywords: NOSOSCF
formula: C17H30O2
InChI: InChI=1/C17H30O2/c1-6-19-17(18)13-16(5)12-8-11-15(4)10-7-9-14(2)3/h8,12-15H,6-7,9-11H2,1-5H3
49 atoms
O  4.513601 -1.732261 0.558488
O  3.560595 -3.434744 -0.526525
C  -3.091914 0.407759 -0.405369
C  -4.12831 1.430195 0.06691
C  -3.627372 2.49784 1.03824
C  -2.405316 3.282996 0.564465
C  -2.547855 3.989052 -0.785626
C  -2.47099 -0.350976 0.779304
C  -3.725396 -0.542003 -1.416545
C  -3.707741 4.978393 -0.79596
C  -1.243203 4.689118 -1.151713
C  -1.415933 -1.323828 0.368985
C  -0.108773 -1.136188 0.568753
C  0.955742 -2.042494 0.143503
C  0.554506 -3.298196 -0.565602
C  2.221837 -1.673288 0.419415
C  3.455801 -2.400008 0.082826
C  5.801857 -2.295353 0.322832
C  6.82685 -1.375358 0.943744
H  -2.279318 0.940212 -0.912676
H  -4.963426 0.895227 0.533052
H  -4.552385 1.917613 -0.817012
H  -3.393738 2.042427 2.004587
H  -4.450159 3.187744 1.244405
H  -2.157151 4.031908 1.324962
H  -1.537728 2.615634 0.51923
H  -2.742417 3.232242 -1.554665
H  -3.27045 -0.879596 1.31206
H  -2.042629 0.361629 1.487978
H  -2.996306 -1.221625 -1.858446
H  -4.508426 -1.146626 -0.952146
H  -4.184176 0.013635 -2.23574
H  -4.669092 4.491054 -0.628904
H  -3.772146 5.498575 -1.752795
H  -3.582569 5.735942 -0.01824
H  -0.997032 5.464088 -0.421995
H  -0.407341 3.988128 -1.181822
H  -1.307666 5.167416 -2.130102
H  -1.754118 -2.221234 -0.138631
H  0.210954 -0.233986 1.083707
H  -0.137778 -3.872753 0.052652
H  1.400095 -3.92734 -0.812528
H  0.027321 -3.054198 -1.490298
H  2.375381 -0.739422 0.947562
H  5.973127 -2.403604 -0.751142
H  5.859183 -3.295559 0.759609
H  6.789656 -0.379368 0.503171
H  6.679533 -1.279672 2.019191
H  7.826613 -1.776594 0.778149
totalener: -816.41231725 hartree
nucrepener: 1401.76900682 hartree
electener: -2218.18132407 hartree
oneelecener: -3888.43050191 hartree
twoeener: 1670.24917784 hartree
kineticenergy: 812.47362705 hartree
xcener: -82.314382647276 hartree
chargesum: -0.0000000
charge: -0.267992 -0.394805 0.097857 -0.176935 -0.170956 -0.160096 0.028833 -0.170946 -0.295502 -0.272075 -0.257757 -0.123227 -0.080960 0.027183 -0.266829 -0.146555 0.395196 0.034541 -0.231781 0.047238 0.082186 0.073943 0.081945 0.084623 0.081321 0.066856 0.030384 0.092456 0.074608 0.085301 0.083084 0.085611 0.076966 0.085480 0.081344 0.075962 0.082848 0.083027 0.101492 0.070007 0.088387 0.124818 0.089794 0.093634 0.084070 0.083980 0.082053 0.082445 0.076945
qa: -0.2680 -0.3948 0.0979 -0.1769 -0.1710 -0.1601 0.0288 -0.1709 -0.2955 -0.2721 -0.2578 -0.1232 -0.0810 0.0272 -0.2668 -0.1466 0.3952 0.0345 -0.2318 0.0472 0.0822 0.0739 0.0819 0.0846 0.0813 0.0669 0.0304 0.0925 0.0746 0.0853 0.0831 0.0856 0.0770 0.0855 0.0813 0.0760 0.0828 0.0830 0.1015 0.0700 0.0884 0.1248 0.0898 0.0936 0.0841 0.0840 0.0821 0.0824 0.0769
va: 2.1246 2.1094 3.7139 3.8777 3.9003 3.8677 3.8372 3.9645 3.9583 3.9450 3.9313 3.8870 3.9501 3.6890 3.9237 3.8107 4.2285 3.8828 3.9550 1.0235 1.0130 1.0063 1.0046 1.0028 1.0137 1.0092 1.0139 1.0106 1.0199 1.0047 1.0032 1.0078 1.0065 1.0087 1.0053 1.0068 1.0067 1.0078 1.0042 1.0314 0.9971 1.0397 0.9987 1.0357 0.9996 0.9991 1.0056 1.0054 1.0087
dispcorr: -0.019956623 hartree
energy: -816.432273871303
dipole: -21.31041 20.88278 -0.42764 21.77366 -21.13488 0.63878 -2.84685 3.09438 0.24753
magnitude: 0.80758 au
magnitude: 2.05270 debye
