program: Orca
programVersion: 5.0.2
elementType: O O O O N C C C C C C C C C C C C C C C C C H H H H H H H H H H H H H H H H H H H
charge: 0
multiplicity: 1
keywords: wb97x-d3
keywords: def2-TZVPP
keywords: def2/J RIJCOSX
keywords: DEFGRID2
keywords: scfconv7
keywords: smallprint printgap noloewdin
keywords: NOSOSCF
formula: C17H19NO4
InChI: InChI=1/C17H19NO4/c1-2-20-17(19)18-12-13-21-14-8-10-16(11-9-14)22-15-6-4-3-5-7-15/h3-11,18H,2,12-13H2,1H3
41 atoms
O  -2.679092 -2.009978 -0.495879
O  2.397752 -0.751392 1.2547
O  -2.079718 2.589795 -0.485207
O  -4.000871 1.987718 0.539988
N  -3.2150 0.860157 -1.266677
C  -3.860997 -1.293813 -0.170405
C  -4.174119 -0.217632 -1.194232
C  -1.461266 -1.618396 -0.04427
C  1.14446 -1.033823 0.763045
C  -0.374987 -2.310977 -0.580502
C  -1.226411 -0.632851 0.908877
C  0.917556 -2.032064 -0.176473
C  0.074549 -0.339347 1.298444
C  3.474465 -0.666797 0.41317
C  -3.160102 1.820431 -0.327041
C  3.383413 -0.198368 -0.892474
C  4.704765 -1.027221 0.949123
C  -1.88753 3.682041 0.424877
C  4.53665 -0.107372 -1.660261
C  5.848955 -0.91963 0.173309
C  5.77137 -0.466445 -1.136927
C  -1.263237 3.245517 1.729983
H  -4.668037 -2.027246 -0.194549
H  -3.831311 -0.891433 0.843894
H  -4.232395 -0.667981 -2.18421
H  -5.165109 0.182434 -0.978285
H  -0.549426 -3.086375 -1.315716
H  -2.030081 -0.080405 1.375039
H  1.738514 -2.597892 -0.598158
H  0.246124 0.433405 2.037149
H  -2.403849 0.726303 -1.851219
H  2.431127 0.095866 -1.3146
H  4.76212 -1.383974 1.969797
H  -2.828389 4.208267 0.590833
H  -1.220473 4.361207 -0.103701
H  4.464144 0.252051 -2.678424
H  6.804585 -1.199168 0.597267
H  6.664145 -0.391474 -1.742995
H  -1.915686 2.588502 2.304116
H  -0.312806 2.737666 1.565643
H  -1.065134 4.128519 2.338552
elementType: O N C H
totalener: -1015.01790530 hartree
nucrepener: 1760.46175644 hartree
electener: -2775.47966174 hartree
oneelecener: -4879.00978666 hartree
twoeener: 2103.53012492 hartree
cpcmener: -0.03516642 hartree
kineticenergy: 1010.61618462 hartree
xcener: -97.182869046125 hartree
chargesum: 0.0000000
charge: -0.351398 -0.346127 -0.330529 -0.554816 -0.238034 0.022037 -0.031448 0.261493 0.269942 -0.218402 -0.151272 -0.188410 -0.273936 0.310974 0.505964 -0.207924 -0.263952 0.054789 -0.152682 -0.123414 -0.194690 -0.278781 0.115077 0.101797 0.106267 0.099274 0.140659 0.142149 0.157299 0.156224 0.187904 0.158457 0.146779 0.090140 0.109026 0.162264 0.160932 0.160759 0.091533 0.087826 0.106253
qa: -0.3514 -0.3461 -0.3305 -0.5548 -0.2380 0.0220 -0.0314 0.2615 0.2699 -0.2184 -0.1513 -0.1884 -0.2739 0.3110 0.5060 -0.2079 -0.2640 0.0548 -0.1527 -0.1234 -0.1947 -0.2788 0.1151 0.1018 0.1063 0.0993 0.1407 0.1421 0.1573 0.1562 0.1879 0.1585 0.1468 0.0901 0.1090 0.1623 0.1609 0.1608 0.0915 0.0878 0.1063
va: 2.0434 2.0509 2.0666 1.9403 3.1852 3.8286 3.8852 3.7946 3.7178 3.9994 3.8010 3.9649 4.0363 3.6638 4.3199 3.8984 4.0009 3.8361 3.8915 3.8810 3.9000 3.9125 1.0043 1.0034 1.0070 1.0194 1.0107 1.0070 0.9939 1.0031 1.0077 0.9975 1.0090 1.0121 0.9957 0.9894 0.9880 0.9897 1.0087 1.0020 1.0113
dispcorr: -0.019679592 hartree
energy: -1015.037584892969
dipole: -3.00483 3.38026 0.37543 7.01618 -6.97702 0.03916 0.52466 -1.66923 -1.14457
magnitude: 1.20521 au
magnitude: 3.06340 debye
