program: Orca
programVersion: 5.0.2
elementType: O O O O N C C C C C C C C C C C C C C C C C H H H H H H H H H H H H H H H H H H H
charge: 0
multiplicity: 1
keywords: wb97x-d3
keywords: def2-TZVPP
keywords: def2/J RIJCOSX
keywords: DEFGRID2
keywords: scfconv7
keywords: smallprint printgap noloewdin
keywords: NOSOSCF
formula: C17H19NO4
InChI: InChI=1/C17H19NO4/c1-2-20-17(19)18-12-13-21-14-8-10-16(11-9-14)22-15-6-4-3-5-7-15/h3-11,18H,2,12-13H2,1H3
41 atoms
O  -2.736548 -1.993821 -0.544909
O  2.380548 -0.868074 1.174446
O  -1.973495 2.557246 -0.327106
O  -3.887586 1.969026 0.719676
N  -3.19002 0.911459 -1.163985
C  -3.90062 -1.271509 -0.172599
C  -4.190484 -0.130012 -1.129904
C  -1.50669 -1.634636 -0.097843
C  1.116579 -1.110636 0.689861
C  -0.433367 -2.268356 -0.724472
C  -1.250257 -0.737827 0.934115
C  0.868889 -2.019435 -0.33126
C  0.059305 -0.473351 1.314166
C  3.435466 -0.689234 0.320638
C  -3.076117 1.81811 -0.177836
C  4.682881 -1.076598 0.794622
C  3.307781 -0.103788 -0.933751
C  -1.730717 3.611721 0.614742
C  5.807828 -0.874482 0.009695
C  4.442344 0.081362 -1.712389
C  5.694087 -0.300878 -1.249875
C  -1.089373 3.115854 1.88985
H  -4.724346 -1.983649 -0.235633
H  -3.858613 -0.930042 0.86326
H  -4.284012 -0.52265 -2.141492
H  -5.160924 0.295257 -0.8724
H  -0.624946 -2.974376 -1.522624
H  -2.043041 -0.231901 1.467028
H  1.680658 -2.538599 -0.824756
H  0.248712 0.228928 2.11603
H  -2.401276 0.782536 -1.779419
H  4.768734 -1.52701 1.775489
H  2.341776 0.21093 -1.307089
H  -2.652915 4.156817 0.81971
H  -1.057292 4.290439 0.093637
H  6.777145 -1.174696 0.385646
H  4.341361 0.534345 -2.690002
H  6.572229 -0.150919 -1.863381
H  -0.155422 2.591246 1.687772
H  -0.856344 3.972842 2.522753
H  -1.74539 2.455879 2.456356
elementType: O N C H
totalener: -1015.01785995 hartree
nucrepener: 1766.49514177 hartree
electener: -2781.51300172 hartree
oneelecener: -4891.12206447 hartree
twoeener: 2109.60906275 hartree
cpcmener: -0.03515804 hartree
kineticenergy: 1010.62087366 hartree
xcener: -97.183973277008 hartree
chargesum: 0.0000000
charge: -0.353038 -0.345841 -0.330862 -0.555278 -0.237458 0.023696 -0.031456 0.254990 0.273798 -0.214758 -0.147083 -0.187616 -0.278918 0.312876 0.506926 -0.264802 -0.207673 0.053813 -0.123074 -0.153463 -0.195259 -0.279446 0.114684 0.101374 0.106299 0.099046 0.140553 0.141944 0.156565 0.156778 0.188219 0.146890 0.157647 0.090315 0.109004 0.160310 0.162537 0.160805 0.088497 0.106599 0.091855
qa: -0.3530 -0.3458 -0.3309 -0.5553 -0.2375 0.0237 -0.0315 0.2550 0.2738 -0.2148 -0.1471 -0.1876 -0.2789 0.3129 0.5069 -0.2648 -0.2077 0.0538 -0.1231 -0.1535 -0.1953 -0.2794 0.1147 0.1014 0.1063 0.0990 0.1406 0.1419 0.1566 0.1568 0.1882 0.1469 0.1576 0.0903 0.1090 0.1603 0.1625 0.1608 0.0885 0.1066 0.0919
va: 2.0417 2.0508 2.0655 1.9402 3.1842 3.8284 3.8862 3.7930 3.7095 3.9989 3.7866 3.9658 4.0344 3.6620 4.3190 4.0013 3.8979 3.8373 3.8817 3.8930 3.9004 3.9130 1.0045 1.0032 1.0068 1.0191 1.0107 1.0100 0.9942 1.0020 1.0072 1.0090 0.9984 1.0119 0.9959 0.9882 0.9893 0.9896 1.0013 1.0112 1.0087
dispcorr: -0.019819729 hartree
energy: -1015.037679680210
dipole: -2.76696 3.09236 0.32540 7.16317 -7.04095 0.12222 0.81408 -1.99572 -1.18164
magnitude: 1.23170 au
magnitude: 3.13074 debye
