program: Orca
programVersion: 5.0.2
elementType: O O O O N C C C C C C C C C C C C C C C C C H H H H H H H H H H H H H H H H H H H
charge: 0
multiplicity: 1
keywords: wb97x-d3
keywords: def2-TZVPP
keywords: def2/J RIJCOSX
keywords: DEFGRID2
keywords: scfconv7
keywords: smallprint printgap noloewdin
keywords: NOSOSCF
formula: C17H19NO4
InChI: InChI=1/C17H19NO4/c1-2-20-17(19)18-12-13-21-14-8-10-16(11-9-14)22-15-6-4-3-5-7-15/h3-11,18H,2,12-13H2,1H3
41 atoms
O  -2.797929 -2.091894 -0.050861
O  2.302062 -0.666741 -1.593365
O  -1.707909 2.2110 1.203346
O  -3.699406 2.108671 0.142138
N  -3.00178 0.44571 1.518743
C  -3.929518 -1.234386 -0.080811
C  -4.084882 -0.461051 1.2152
C  -1.571037 -1.652471 -0.43015
C  1.03503 -0.993985 -1.162717
C  -1.322382 -0.513834 -1.189383
C  -0.498428 -2.458734 -0.046377
C  -0.019441 -0.185615 -1.544011
C  0.795061 -2.139349 -0.415033
C  3.314691 -0.553447 -0.678568
C  -2.863627 1.62214 0.884305
C  3.101886 -0.204953 0.650326
C  4.603592 -0.766841 -1.153184
C  -1.429991 3.502202 0.642851
C  4.191883 -0.086652 1.502429
C  5.681977 -0.634786 -0.291765
C  5.483398 -0.301802 1.041949
C  -0.855316 3.414709 -0.751601
H  -3.920291 -0.571398 -0.947072
H  -4.795178 -1.887815 -0.193065
H  -5.027759 0.084589 1.177498
H  -4.164983 -1.159582 2.046665
H  -2.117762 0.139573 -1.519688
H  -0.684112 -3.349902 0.539675
H  0.164283 0.704708 -2.131789
H  1.610718 -2.785202 -0.115113
H  -2.200395 0.074104 2.00524
H  2.103576 -0.023563 1.027447
H  4.757882 -1.033355 -2.191218
H  -0.704024 3.943728 1.323773
H  -2.323628 4.127053 0.666368
H  4.022903 0.18112 2.537224
H  6.68299 -0.803176 -0.667062
H  6.325873 -0.208106 1.713836
H  -1.56064 2.990753 -1.465823
H  -0.603712 4.419469 -1.09294
H  0.058628 2.820986 -0.768119
elementType: O N C H
totalener: -1015.01825254 hartree
nucrepener: 1779.65887764 hartree
electener: -2794.67713017 hartree
oneelecener: -4917.41909971 hartree
twoeener: 2122.74196954 hartree
cpcmener: -0.03537665 hartree
kineticenergy: 1010.62636574 hartree
xcener: -97.184339155555 hartree
chargesum: 0.0000000
charge: -0.354114 -0.348096 -0.332406 -0.557377 -0.236766 0.026598 -0.032194 0.247814 0.253550 -0.147104 -0.211062 -0.268830 -0.171508 0.296672 0.511359 -0.192144 -0.254525 0.051219 -0.163556 -0.128069 -0.193673 -0.278190 0.101059 0.114175 0.098546 0.106724 0.143613 0.140889 0.158281 0.158593 0.187827 0.154464 0.146474 0.108723 0.091723 0.161969 0.160854 0.161015 0.091671 0.107132 0.088672
qa: -0.3541 -0.3481 -0.3324 -0.5574 -0.2368 0.0266 -0.0322 0.2478 0.2536 -0.1471 -0.2111 -0.2688 -0.1715 0.2967 0.5114 -0.1921 -0.2545 0.0512 -0.1636 -0.1281 -0.1937 -0.2782 0.1011 0.1142 0.0985 0.1067 0.1436 0.1409 0.1583 0.1586 0.1878 0.1545 0.1465 0.1087 0.0917 0.1620 0.1609 0.1610 0.0917 0.1071 0.0887
va: 2.0392 2.0442 2.0624 1.9384 3.1860 3.8287 3.8879 3.7893 3.7118 3.7649 3.9951 4.0309 3.9705 3.6757 4.3121 3.8725 3.9940 3.8364 3.9042 3.8895 3.8966 3.9149 1.0033 1.0047 1.0193 1.0062 1.0104 1.0103 0.9994 0.9930 1.0072 1.0024 1.0088 0.9962 1.0122 0.9897 0.9879 0.9894 1.0090 1.0110 1.0003
dispcorr: -0.020163452 hartree
energy: -1015.038415988032
dipole: -2.38229 2.65249 0.27020 7.50560 -7.70746 -0.20186 2.02204 -0.84752 1.17453
magnitude: 1.22199 au
magnitude: 3.10606 debye
