program: Orca
programVersion: 5.0.2
elementType: O O O O N C C C C C C C C C C C C C C C C C H H H H H H H H H H H H H H H H H H H
charge: 0
multiplicity: 1
keywords: wb97x-d3
keywords: def2-TZVPP
keywords: def2/J RIJCOSX
keywords: DEFGRID2
keywords: scfconv7
keywords: smallprint printgap noloewdin
keywords: NOSOSCF
formula: C17H19NO4
InChI: InChI=1/C17H19NO4/c1-2-20-17(19)18-12-13-21-14-8-10-16(11-9-14)22-15-6-4-3-5-7-15/h3-11,18H,2,12-13H2,1H3
41 atoms
O  -3.175528 -1.929686 0.301567
O  2.335803 -2.011042 0.387984
O  -1.385084 2.173576 -0.780609
O  -3.224467 2.477066 0.488667
N  -3.090029 0.784894 -1.022942
C  -4.014606 -0.832936 0.634613
C  -4.260372 0.076136 -0.555544
C  -1.821478 -1.829911 0.337168
C  0.965994 -1.885356 0.346587
C  -1.128321 -2.826059 -0.347947
C  -1.100945 -0.856874 1.025472
C  0.255374 -2.852083 -0.34822
C  0.287529 -0.889042 1.031651
C  3.142318 -0.921832 0.196663
C  -2.611467 1.856652 -0.363034
C  2.800918 0.139356 -0.633122
C  4.374477 -0.947014 0.839293
C  -0.768965 3.351997 -0.240541
C  3.702189 1.182115 -0.803693
C  5.266914 0.097276 0.651182
C  4.934146 1.17068 -0.164763
C  0.708454 3.266057 -0.524373
H  -4.966639 -1.273854 0.932758
H  -3.640819 -0.274423 1.495543
H  -4.649024 -0.510045 -1.388102
H  -5.039625 0.790377 -0.288917
H  -1.679769 -3.585684 -0.887273
H  -1.591159 -0.071736 1.58445
H  0.780439 -3.632271 -0.884365
H  0.826919 -0.131531 1.586544
H  -2.446759 0.275524 -1.610612
H  1.847454 0.164635 -1.145307
H  4.629969 -1.781291 1.48017
H  -0.944354 3.414147 0.833489
H  -1.211115 4.233981 -0.708035
H  3.431547 2.010169 -1.445996
H  6.224308 0.072848 1.15495
H  5.628732 1.98814 -0.303077
H  1.158917 2.420976 -0.004873
H  0.916669 3.173214 -1.590371
H  1.195015 4.173368 -0.166984
elementType: O N C H
totalener: -1015.01803406 hartree
nucrepener: 1793.66343575 hartree
electener: -2808.68146981 hartree
oneelecener: -4945.09397450 hartree
twoeener: 2136.41250469 hartree
cpcmener: -0.03572145 hartree
kineticenergy: 1010.61910305 hartree
xcener: -97.182412957140 hartree
chargesum: -0.0000000
charge: -0.355983 -0.346819 -0.324720 -0.557399 -0.243513 0.020894 -0.025666 0.245238 0.277545 -0.191896 -0.170180 -0.232339 -0.229750 0.321977 0.517925 -0.217794 -0.265147 0.040774 -0.153431 -0.120534 -0.205719 -0.254590 0.115386 0.103158 0.105844 0.097204 0.140087 0.147938 0.146644 0.161519 0.187256 0.160671 0.147006 0.091448 0.107507 0.168634 0.160401 0.160863 0.076461 0.094423 0.098675
qa: -0.3560 -0.3468 -0.3247 -0.5574 -0.2435 0.0209 -0.0257 0.2452 0.2775 -0.1919 -0.1702 -0.2323 -0.2297 0.3220 0.5179 -0.2178 -0.2651 0.0408 -0.1534 -0.1205 -0.2057 -0.2546 0.1154 0.1032 0.1058 0.0972 0.1401 0.1479 0.1466 0.1615 0.1873 0.1607 0.1470 0.0914 0.1075 0.1686 0.1604 0.1609 0.0765 0.0944 0.0987
va: 2.0370 2.0556 2.0684 1.9435 3.1839 3.8396 3.8788 3.7632 3.6672 3.9857 3.8075 4.0502 3.9615 3.6619 4.3031 3.8611 4.0038 3.8550 3.8680 3.8835 3.9260 3.9653 1.0043 1.0027 1.0079 1.0218 1.0093 1.0072 1.0048 0.9957 1.0074 0.9987 1.0085 1.0033 0.9959 0.9834 0.9876 0.9901 0.9967 1.0002 1.0080
dispcorr: -0.020810306 hartree
energy: -1015.038844369650
dipole: 0.40851 -0.21645 0.19206 10.67638 -10.35932 0.31707 -1.48890 0.76551 -0.72339
magnitude: 0.81284 au
magnitude: 2.06609 debye
