program: Orca
programVersion: 5.0.2
elementType: O O O O N C C C C C C C C C C C C C C C C C H H H H H H H H H H H H H H H H H H H
charge: 0
multiplicity: 1
keywords: wb97x-d3
keywords: def2-TZVPP
keywords: def2/J RIJCOSX
keywords: DEFGRID2
keywords: scfconv7
keywords: smallprint printgap noloewdin
keywords: NOSOSCF
formula: C17H19NO4
InChI: InChI=1/C17H19NO4/c1-2-20-17(19)18-12-13-21-14-8-10-16(11-9-14)22-15-6-4-3-5-7-15/h3-11,18H,2,12-13H2,1H3
41 atoms
O  -3.2003 -1.727541 -0.216463
O  2.093257 -0.832049 -1.490476
O  -1.245776 1.858081 0.499392
O  -3.337919 1.740029 -0.320217
N  -2.726116 0.582501 1.544017
C  -3.648529 -1.684259 1.132217
C  -3.894357 -0.265163 1.614672
C  -1.87388 -1.53543 -0.47274
C  0.791214 -1.065603 -1.115361
C  -1.542551 -0.785223 -1.596015
C  -0.856803 -2.088258 0.300591
C  -0.214384 -0.541536 -1.910933
C  0.470499 -1.857689 -0.022462
C  3.026282 -0.46594 -0.557432
C  -2.503565 1.409927 0.504567
C  2.711519 0.229833 0.604363
C  4.346249 -0.784206 -0.851756
C  -0.907222 2.843559 -0.487842
C  3.73282 0.604655 1.466529
C  5.355205 -0.397075 0.016973
C  5.055688 0.296438 1.181691
C  0.579015 3.082449 -0.42385
H  -4.591711 -2.231166 1.16123
H  -2.960238 -2.201354 1.804516
H  -4.699655 0.196427 1.04698
H  -4.234053 -0.323195 2.650334
H  -2.325928 -0.368421 -2.215263
H  -1.076113 -2.709486 1.158397
H  0.033753 0.063634 -2.773479
H  1.246499 -2.301788 0.587797
H  -1.923769 0.300202 2.089103
H  1.688153 0.487977 0.843271
H  4.579552 -1.326619 -1.75898
H  -1.456001 3.764729 -0.282177
H  -1.190835 2.495202 -1.481957
H  3.48457 1.147981 2.36867
H  6.381312 -0.646479 -0.21877
H  5.844352 0.592828 1.859836
H  1.14169 2.197974 -0.719611
H  0.836445 3.883454 -1.116797
H  0.902476 3.387008 0.571192
elementType: O N C H
totalener: -1015.01756387 hartree
nucrepener: 1839.64448204 hartree
electener: -2854.66204592 hartree
oneelecener: -5037.70390613 hartree
twoeener: 2183.04186022 hartree
cpcmener: -0.04138227 hartree
kineticenergy: 1010.63644626 hartree
xcener: -97.188323736229 hartree
chargesum: -0.0000000
charge: -0.370805 -0.347469 -0.323466 -0.552267 -0.217289 0.022520 -0.016442 0.171409 0.311220 -0.112118 -0.131163 -0.317321 -0.198766 0.366057 0.493772 -0.242997 -0.266172 0.013574 -0.168279 -0.122340 -0.195434 -0.250677 0.110266 0.101035 0.096115 0.102580 0.141256 0.152025 0.147281 0.157912 0.174961 0.150133 0.146357 0.122358 0.099785 0.160968 0.160009 0.160828 0.075201 0.101603 0.093780
qa: -0.3708 -0.3475 -0.3235 -0.5523 -0.2173 0.0225 -0.0164 0.1714 0.3112 -0.1121 -0.1312 -0.3173 -0.1988 0.3661 0.4938 -0.2430 -0.2662 0.0136 -0.1683 -0.1223 -0.1954 -0.2507 0.1103 0.1010 0.0961 0.1026 0.1413 0.1520 0.1473 0.1579 0.1750 0.1501 0.1464 0.1224 0.0998 0.1610 0.1600 0.1608 0.0752 0.1016 0.0938
va: 2.0105 2.0476 2.0515 1.9454 3.2019 3.8637 3.8431 3.8447 3.6151 3.8308 3.8222 4.0258 3.9267 3.5783 4.3342 3.8888 4.0071 3.8271 3.9282 3.8789 3.9063 3.9507 1.0058 0.9973 1.0278 1.0099 1.0173 0.9988 1.0065 0.9954 1.0147 1.0027 1.0092 0.9997 0.9952 0.9909 0.9881 0.9894 0.9988 1.0091 1.0046
dispcorr: -0.022600536 hartree
energy: -1015.040164409807
dipole: 1.47111 -0.67293 0.79818 6.31864 -6.76310 -0.44446 5.48897 -3.27821 2.21076
magnitude: 2.39209 au
magnitude: 6.08022 debye
