program: Orca
programVersion: 5.0.2
elementType: O O O O N C C C C C C C C C C C C C C C C C H H H H H H H H H H H H H H H H H H H
charge: 0
multiplicity: 1
keywords: wb97x-d3
keywords: def2-TZVPP
keywords: def2/J RIJCOSX
keywords: DEFGRID2
keywords: scfconv7
keywords: smallprint printgap noloewdin
keywords: NOSOSCF
formula: C17H19NO4
InChI: InChI=1/C17H19NO4/c1-2-20-17(19)18-12-13-21-14-8-10-16(11-9-14)22-15-6-4-3-5-7-15/h3-11,18H,2,12-13H2,1H3
41 atoms
O  -2.692956 -2.21349 -0.66133
O  2.03762 0.272439 0.710267
O  -1.921482 1.996849 0.035046
O  -3.671263 1.234984 1.233729
N  -3.378916 0.646908 -0.942317
C  -3.916688 -1.671315 -0.176965
C  -4.344181 -0.43182 -0.946311
C  -1.528203 -1.605029 -0.284183
C  0.896621 -0.404243 0.35196
C  -0.592629 -1.336682 -1.278199
C  -1.232214 -1.285854 1.036476
C  0.615891 -0.736089 -0.966731
C  -0.020324 -0.686972 1.350757
C  3.250646 -0.098371 0.194455
C  -3.035867 1.282143 0.194643
C  3.585679 -1.42421 -0.053671
C  4.173063 0.91702 -0.021486
C  -1.449546 2.746716 1.163298
C  4.854791 -1.723137 -0.529606
C  5.440614 0.60127 -0.487999
C  5.786209 -0.71749 -0.750717
C  -0.155018 3.408853 0.766863
H  -4.670758 -2.445067 -0.323345
H  -3.869196 -1.472117 0.895291
H  -4.52433 -0.689054 -1.988755
H  -5.297482 -0.090237 -0.540001
H  -0.81974 -1.582434 -2.307911
H  -1.926674 -1.506666 1.836192
H  1.320874 -0.515638 -1.758298
H  0.205108 -0.436203 2.379492
H  -2.699217 0.647213 -1.687923
H  2.874514 -2.220755 0.124042
H  3.898921 1.945316 0.17834
H  -1.295093 2.08094 2.014759
H  -2.193459 3.494039 1.446928
H  5.115515 -2.755591 -0.722294
H  6.157071 1.394906 -0.654742
H  6.773279 -0.959855 -1.120891
H  0.613957 2.679002 0.514733
H  -0.287341 4.082877 -0.07945
H  0.211219 3.998487 1.606936
elementType: O N C H
totalener: -1015.01784136 hartree
nucrepener: 1812.62500441 hartree
electener: -2827.64284577 hartree
oneelecener: -4983.77831698 hartree
twoeener: 2156.13547121 hartree
cpcmener: -0.03581117 hartree
kineticenergy: 1010.62958308 hartree
xcener: -97.183901188765 hartree
chargesum: -0.0000000
charge: -0.377294 -0.350411 -0.320264 -0.550241 -0.216977 0.028816 -0.041810 0.197316 0.272411 -0.193482 -0.093919 -0.166152 -0.291021 0.286215 0.491860 -0.193349 -0.259564 0.012844 -0.156093 -0.123375 -0.191007 -0.246911 0.112744 0.096775 0.107245 0.098860 0.145545 0.152845 0.160522 0.148726 0.182543 0.156672 0.150039 0.103821 0.119508 0.161686 0.161255 0.160810 0.078888 0.091662 0.092265
qa: -0.3773 -0.3504 -0.3203 -0.5502 -0.2170 0.0288 -0.0418 0.1973 0.2724 -0.1935 -0.0939 -0.1662 -0.2910 0.2862 0.4919 -0.1933 -0.2596 0.0128 -0.1561 -0.1234 -0.1910 -0.2469 0.1127 0.0968 0.1072 0.0989 0.1455 0.1528 0.1605 0.1487 0.1825 0.1567 0.1500 0.1038 0.1195 0.1617 0.1613 0.1608 0.0789 0.0917 0.0923
va: 1.9975 2.0058 2.0604 1.9478 3.1811 3.8274 3.8778 3.8135 3.5672 3.9856 3.7297 3.9502 3.9727 3.6954 4.3419 3.9035 3.9832 3.8249 3.8986 3.8837 3.8969 3.9671 1.0072 1.0086 1.0061 1.0156 1.0079 0.9974 0.9941 1.0083 1.0111 0.9981 1.0043 0.9942 1.0006 0.9896 0.9887 0.9896 1.0081 1.0042 1.0075
dispcorr: -0.021789695 hartree
energy: -1015.039631058599
dipole: -0.52053 0.97322 0.45269 5.47754 -5.58893 -0.11138 -0.30595 -0.82941 -1.13536
magnitude: 1.22735 au
magnitude: 3.11967 debye
