program: Orca
programVersion: 5.0.2
elementType: O O O O N C C C C C C C C C C C C C C C C C H H H H H H H H H H H H H H H H H H H
charge: 0
multiplicity: 1
keywords: wb97x-d3
keywords: def2-TZVPP
keywords: def2/J RIJCOSX
keywords: DEFGRID2
keywords: scfconv7
keywords: smallprint printgap noloewdin
keywords: NOSOSCF
formula: C17H19NO4
InChI: InChI=1/C17H19NO4/c1-2-20-17(19)18-12-13-21-14-8-10-16(11-9-14)22-15-6-4-3-5-7-15/h3-11,18H,2,12-13H2,1H3
41 atoms
O  -1.873729 -0.340631 -0.204555
O  3.593481 0.018103 0.339821
O  -4.72351 2.44803 0.686204
O  -4.579524 0.317417 1.406146
N  -4.423396 0.845774 -0.804251
C  -2.494975 -0.548536 -1.460444
C  -3.992265 -0.45043 -1.270232
C  -0.52349 -0.283363 -0.14919
C  2.236925 -0.131318 0.156359
C  0.034704 -0.015805 1.099966
C  0.313925 -0.475231 -1.244438
C  1.407814 0.050568 1.253957
C  1.69148 -0.389723 -1.089885
C  4.451329 -0.936017 -0.139589
C  -4.56608 1.134111 0.502154
C  4.111559 -2.281121 -0.224745
C  5.7209 -0.504681 -0.503447
C  -4.982431 2.909108 2.019566
C  5.053638 -3.18997 -0.686998
C  6.653856 -1.426436 -0.954652
C  6.324679 -2.771592 -1.055675
C  -5.028237 4.415862 1.980639
H  -2.163215 0.204026 -2.184064
H  -2.246002 -1.536073 -1.863224
H  -4.461173 -0.652756 -2.233351
H  -4.346167 -1.218718 -0.58466
H  -0.61322 0.134777 1.954197
H  -0.080411 -0.686766 -2.22864
H  1.833468 0.255374 2.228005
H  2.328889 -0.528068 -1.954152
H  -4.330967 1.618287 -1.447475
H  3.128274 -2.627014 0.066476
H  5.97461 0.545341 -0.43045
H  -4.196469 2.567727 2.695865
H  -5.932965 2.502908 2.37223
H  4.786695 -4.236582 -0.753481
H  7.641461 -1.085785 -1.236845
H  7.052362 -3.486881 -1.414564
H  -4.073908 4.839488 1.667174
H  -5.80834 4.780888 1.312173
H  -5.245941 4.791525 2.980304
elementType: O N C H
totalener: -1015.02157654 hartree
nucrepener: 1660.65530994 hartree
electener: -2675.67688649 hartree
oneelecener: -4680.15993714 hartree
twoeener: 2004.48305065 hartree
cpcmener: -0.04357565 hartree
kineticenergy: 1010.62654538 hartree
xcener: -97.181300429430 hartree
chargesum: -0.0000000
charge: -0.338274 -0.348526 -0.330682 -0.568879 -0.233887 0.030737 -0.040519 0.304438 0.226062 -0.227294 -0.188433 -0.201777 -0.211196 0.288422 0.527497 -0.189071 -0.252120 0.047630 -0.158591 -0.128173 -0.192741 -0.253371 0.103648 0.108599 0.109054 0.100313 0.142933 0.145185 0.148990 0.160952 0.176008 0.156361 0.147369 0.093315 0.097267 0.162387 0.160430 0.160921 0.088115 0.087870 0.089031
qa: -0.3383 -0.3485 -0.3307 -0.5689 -0.2339 0.0307 -0.0405 0.3044 0.2261 -0.2273 -0.1884 -0.2018 -0.2112 0.2884 0.5275 -0.1891 -0.2521 0.0476 -0.1586 -0.1282 -0.1927 -0.2534 0.1036 0.1086 0.1091 0.1003 0.1429 0.1452 0.1490 0.1610 0.1760 0.1564 0.1474 0.0933 0.0973 0.1624 0.1604 0.1609 0.0881 0.0879 0.0890
va: 2.0625 2.0449 2.0665 1.9247 3.1834 3.8218 3.9058 3.7815 3.7235 3.9777 3.8676 4.0166 3.9905 3.6831 4.3011 3.8820 3.9928 3.8381 3.8981 3.8872 3.8954 3.9750 0.9923 0.9966 1.0051 1.0246 1.0093 1.0075 1.0035 0.9946 1.0141 0.9982 1.0081 0.9973 0.9951 0.9895 0.9881 0.9896 1.0033 1.0029 1.0065
dispcorr: -0.015888554 hartree
energy: -1015.037465095948
dipole: -10.40391 10.10542 -0.29849 5.93688 -5.52917 0.40770 -1.08499 -1.05156 -2.13655
magnitude: 2.19549 au
magnitude: 5.58048 debye
