program: Orca
programVersion: 5.0.2
elementType: O O O O N C C C C C C C C C C C C C C C C C H H H H H H H H H H H H H H H H H H H
charge: 0
multiplicity: 1
keywords: wb97x-d3
keywords: def2-TZVPP
keywords: def2/J RIJCOSX
keywords: DEFGRID2
keywords: scfconv7
keywords: smallprint printgap noloewdin
keywords: NOSOSCF
formula: C17H19NO4
InChI: InChI=1/C17H19NO4/c1-2-20-17(19)18-12-13-21-14-8-10-16(11-9-14)22-15-6-4-3-5-7-15/h3-11,18H,2,12-13H2,1H3
41 atoms
O  -1.844191 -0.987611 -0.404721
O  3.31267 -2.721009 0.452148
O  -4.91205 3.700007 0.243582
O  -4.470831 1.984141 1.638483
N  -4.21384 1.784316 -0.610107
C  -2.218598 0.375404 -0.311888
C  -3.711465 0.43305 -0.594239
C  -0.550914 -1.328279 -0.195405
C  2.054878 -2.22012 0.202162
C  0.449099 -0.430257 0.164841
C  -0.23374 -2.676314 -0.355046
C  1.747666 -0.880138 0.370166
C  1.063026 -3.11855 -0.16544
C  4.412646 -2.093934 -0.07032
C  -4.522714 2.452318 0.513987
C  5.584439 -2.171764 0.671865
C  4.398459 -1.450808 -1.302576
C  -5.294592 4.530296 1.349355
C  6.747111 -1.599669 0.177409
C  5.567843 -0.874345 -1.779026
C  6.744783 -0.942518 -1.045871
C  -5.709769 5.868569 0.792685
H  -2.004523 0.772927 0.685562
H  -1.671209 0.978929 -1.043719
H  -3.9178 -0.006076 -1.569445
H  -4.256917 -0.154438 0.144602
H  0.242031 0.622306 0.300898
H  -1.007977 -3.378672 -0.636771
H  2.510529 -0.170232 0.664038
H  1.301138 -4.16646 -0.296234
H  -4.2225 2.280782 -1.487436
H  5.583297 -2.680062 1.627846
H  3.49204 -1.39654 -1.891632
H  -4.454715 4.643094 2.037666
H  -6.120253 4.067885 1.893637
H  7.657522 -1.66323 0.758864
H  5.554288 -0.37127 -2.737039
H  7.651149 -0.490049 -1.425093
H  -4.89265 6.35521 0.259863
H  -6.561182 5.778518 0.117966
H  -6.00491 6.520011 1.614668
elementType: O N C H
totalener: -1015.02080205 hartree
nucrepener: 1613.56092224 hartree
electener: -2628.58172429 hartree
oneelecener: -4585.32649192 hartree
twoeener: 1956.74476763 hartree
cpcmener: -0.03835307 hartree
kineticenergy: 1010.61102123 hartree
xcener: -97.178593460627 hartree
chargesum: -0.0000000
charge: -0.340455 -0.348062 -0.331929 -0.570247 -0.245124 0.038434 -0.032443 0.297533 0.230391 -0.188065 -0.227750 -0.211745 -0.203068 0.289144 0.540341 -0.253443 -0.190524 0.047739 -0.126580 -0.155155 -0.193882 -0.254049 0.099575 0.102368 0.107583 0.095225 0.144077 0.142376 0.160732 0.147946 0.184874 0.147503 0.156612 0.096736 0.094657 0.160519 0.162521 0.160473 0.087816 0.088401 0.088944
qa: -0.3405 -0.3481 -0.3319 -0.5702 -0.2451 0.0384 -0.0324 0.2975 0.2304 -0.1881 -0.2278 -0.2117 -0.2031 0.2891 0.5403 -0.2534 -0.1905 0.0477 -0.1266 -0.1552 -0.1939 -0.2540 0.0996 0.1024 0.1076 0.0952 0.1441 0.1424 0.1607 0.1479 0.1849 0.1475 0.1566 0.0967 0.0947 0.1605 0.1625 0.1605 0.0878 0.0884 0.0889
va: 2.0583 2.0459 2.0718 1.9258 3.1914 3.7789 3.8750 3.7854 3.7236 3.8535 3.9956 3.9837 4.0186 3.6819 4.2730 3.9955 3.8862 3.8379 3.8851 3.8942 3.8971 3.9761 1.0023 0.9949 1.0082 1.0182 1.0098 1.0088 0.9952 1.0039 1.0108 1.0080 0.9978 0.9959 0.9964 0.9881 0.9893 0.9897 1.0031 1.0028 1.0066
dispcorr: -0.015302826 hartree
energy: -1015.036104877783
dipole: -10.67394 10.49828 -0.17566 16.45615 -14.69247 1.76368 -1.03772 -0.58815 -1.62587
magnitude: 2.40518 au
magnitude: 6.11347 debye
