program: Orca
programVersion: 5.0.2
elementType: O O O O N C C C C C C C C C C C C C C C C C H H H H H H H H H H H H H H H H H H H
charge: 0
multiplicity: 1
keywords: wb97x-d3
keywords: def2-TZVPP
keywords: def2/J RIJCOSX
keywords: DEFGRID2
keywords: scfconv7
keywords: smallprint printgap noloewdin
keywords: NOSOSCF
formula: C17H19NO4
InChI: InChI=1/C17H19NO4/c1-2-20-17(19)18-12-13-21-14-8-10-16(11-9-14)22-15-6-4-3-5-7-15/h3-11,18H,2,12-13H2,1H3
41 atoms
O  -1.873477 -0.990909 -0.345882
O  3.315062 -2.578636 0.603107
O  -5.06633 3.642209 -0.044029
O  -4.69328 1.962256 1.42009
N  -4.272187 1.724288 -0.798562
C  -2.26616 0.369789 -0.36858
C  -3.74611 0.385002 -0.715876
C  -0.576814 -1.297913 -0.108706
C  2.042331 -2.122449 0.339199
C  0.411984 -0.361823 0.178765
C  -0.243447 -2.65034 -0.161209
C  1.71747 -0.77793 0.408197
C  1.060345 -3.060042 0.053138
C  4.381301 -1.985589 -0.021409
C  -4.669701 2.409786 0.286805
C  5.579886 -1.954667 0.680086
C  4.304849 -1.47427 -1.311858
C  -5.523746 4.510297 1.002092
C  6.705544 -1.402685 0.086526
C  5.437155 -0.916037 -1.888007
C  6.63973 -0.873372 -1.195514
C  -4.384638 5.155951 1.756147
H  -2.097028 0.84139 0.605336
H  -1.697271 0.927785 -1.119995
H  -3.901726 -0.0932 -1.682157
H  -4.311392 -0.18688 0.019954
H  0.19085 0.695144 0.236295
H  -1.010217 -3.38205 -0.382327
H  2.473621 -0.038387 0.639945
H  1.31155 -4.111769 0.001836
H  -4.221957 2.204074 -1.68382
H  5.628225 -2.362248 1.682034
H  3.377555 -1.507115 -1.869151
H  -6.194229 3.97422 1.675315
H  -6.113354 5.267034 0.486843
H  7.636891 -1.379632 0.637162
H  5.374169 -0.514432 -2.890954
H  7.517003 -0.43445 -1.651429
H  -4.792592 5.8730 2.469225
H  -3.795184 4.431459 2.316616
H  -3.720381 5.698954 1.083648
elementType: O N C H
totalener: -1015.02005509 hartree
nucrepener: 1624.58532016 hartree
electener: -2639.60537524 hartree
oneelecener: -4607.40927250 hartree
twoeener: 1967.80389726 hartree
cpcmener: -0.03787134 hartree
kineticenergy: 1010.61307943 hartree
xcener: -97.179535097645 hartree
chargesum: 0.0000000
charge: -0.339927 -0.349164 -0.338447 -0.570487 -0.244924 0.035566 -0.031051 0.299543 0.222551 -0.188291 -0.229846 -0.207924 -0.198517 0.280794 0.540436 -0.247652 -0.184589 0.045889 -0.129104 -0.158908 -0.191554 -0.253059 0.101947 0.102048 0.107828 0.094009 0.144429 0.142252 0.161225 0.148703 0.183929 0.147659 0.156894 0.088728 0.107479 0.160450 0.162485 0.160457 0.095216 0.085608 0.087317
qa: -0.3399 -0.3492 -0.3384 -0.5705 -0.2449 0.0356 -0.0311 0.2995 0.2226 -0.1883 -0.2298 -0.2079 -0.1985 0.2808 0.5404 -0.2477 -0.1846 0.0459 -0.1291 -0.1589 -0.1916 -0.2531 0.1019 0.1020 0.1078 0.0940 0.1444 0.1423 0.1612 0.1487 0.1839 0.1477 0.1569 0.0887 0.1075 0.1604 0.1625 0.1605 0.0952 0.0856 0.0873
va: 2.0583 2.0442 2.0715 1.9219 3.1969 3.7854 3.8740 3.7832 3.7297 3.8515 3.9967 3.9817 4.0161 3.6874 4.2763 3.9922 3.8785 3.8576 3.8880 3.8977 3.8954 3.9101 1.0008 0.9939 1.0076 1.0202 1.0096 1.0089 0.9948 1.0032 1.0118 1.0077 0.9974 1.0112 0.9958 0.9881 0.9895 0.9896 1.0077 1.0151 1.0045
dispcorr: -0.015680693 hartree
energy: -1015.035735778503
dipole: -8.05279 8.00043 -0.05236 14.95237 -13.24943 1.70294 0.33592 -2.02610 -1.69017
magnitude: 2.39988 au
magnitude: 6.10002 debye
