program: Orca
programVersion: 5.0.2
elementType: O O O O N C C C C C C C C C C C C C C C C C H H H H H H H H H H H H H H H H H H H
charge: 0
multiplicity: 1
keywords: wb97x-d3
keywords: def2-TZVPP
keywords: def2/J RIJCOSX
keywords: DEFGRID2
keywords: scfconv7
keywords: smallprint printgap noloewdin
keywords: NOSOSCF
formula: C17H19NO4
InChI: InChI=1/C17H19NO4/c1-2-20-17(19)18-12-13-21-14-8-10-16(11-9-14)22-15-6-4-3-5-7-15/h3-11,18H,2,12-13H2,1H3
41 atoms
O  -1.798091 -0.20889 -0.154094
O  3.684505 -0.056212 0.339474
O  -4.557632 2.75979 0.547856
O  -4.537837 0.672928 1.412466
N  -4.304841 1.04676 -0.82176
C  -2.438585 -0.460252 -1.392036
C  -3.929361 -0.294387 -1.198365
C  -0.445411 -0.209091 -0.110787
C  2.32243 -0.16049 0.168259
C  0.373613 -0.466476 -1.206283
C  0.134737 0.068989 1.126122
C  1.75508 -0.431855 -1.065486
C  1.510597 0.084198 1.267133
C  4.509665 -1.03113 -0.155581
C  -4.462915 1.42664 0.458622
C  4.137886 -2.368641 -0.225693
C  5.779733 -0.629817 -0.550562
C  -4.926723 3.324165 1.812569
C  5.048829 -3.300396 -0.704318
C  6.681892 -1.574258 -1.017492
C  6.320392 -2.91211 -1.103343
C  -6.418052 3.251654 2.052594
H  -2.086578 0.238284 -2.158878
H  -2.230361 -1.476861 -1.742173
H  -4.414597 -0.546618 -2.141288
H  -4.303895 -0.998031 -0.456938
H  -0.037279 -0.68968 -2.181087
H  -0.499209 0.268232 1.980977
H  2.378165 -0.619204 -1.93102
H  1.953409 0.297925 2.231659
H  -4.170177 1.771519 -1.511563
H  3.153556 -2.689576 0.089842
H  6.05762 0.414824 -0.488129
H  -4.600781 4.361626 1.754693
H  -4.368938 2.850232 2.621694
H  4.757322 -4.341082 -0.759816
H  7.670431 -1.25742 -1.323296
H  7.023165 -3.645436 -1.475293
H  -6.972285 3.746611 1.254636
H  -6.772476 2.224282 2.134868
H  -6.656715 3.759532 2.987514
elementType: O N C H
totalener: -1015.02094904 hartree
nucrepener: 1658.94910438 hartree
electener: -2673.97005342 hartree
oneelecener: -4676.80116265 hartree
twoeener: 2002.83110923 hartree
cpcmener: -0.04280218 hartree
kineticenergy: 1010.62038996 hartree
xcener: -97.180877621875 hartree
chargesum: -0.0000000
charge: -0.337568 -0.348482 -0.338658 -0.568823 -0.230621 0.029486 -0.038857 0.302973 0.230727 -0.188910 -0.226603 -0.212554 -0.204030 0.290916 0.524413 -0.191460 -0.253386 0.048998 -0.156208 -0.127344 -0.193192 -0.253043 0.102856 0.109718 0.109670 0.098910 0.144657 0.142755 0.160620 0.148640 0.175559 0.156223 0.147323 0.106598 0.086920 0.162387 0.160357 0.161040 0.087198 0.085472 0.095324
qa: -0.3376 -0.3485 -0.3387 -0.5688 -0.2306 0.0295 -0.0389 0.3030 0.2307 -0.1889 -0.2266 -0.2126 -0.2040 0.2909 0.5244 -0.1915 -0.2534 0.0490 -0.1562 -0.1273 -0.1932 -0.2530 0.1029 0.1097 0.1097 0.0989 0.1447 0.1428 0.1606 0.1486 0.1756 0.1562 0.1473 0.1066 0.0869 0.1624 0.1604 0.1610 0.0872 0.0855 0.0953
va: 2.0626 2.0459 2.0661 1.9222 3.1842 3.8245 3.9058 3.7812 3.7210 3.8690 3.9802 3.9880 4.0156 3.6804 4.3083 3.8866 3.9947 3.8531 3.8960 3.8859 3.8961 3.9139 0.9921 0.9971 1.0047 1.0262 1.0078 1.0092 0.9948 1.0037 1.0148 0.9980 1.0082 0.9958 1.0130 0.9895 0.9882 0.9895 1.0047 1.0141 1.0080
dispcorr: -0.016090418 hartree
energy: -1015.037039456738
dipole: -13.48109 13.11860 -0.36250 3.44877 -3.21887 0.22990 -0.99024 -1.19630 -2.18654
magnitude: 2.22828 au
magnitude: 5.66383 debye
