program: Orca
programVersion: 5.0.2
elementType: O O O O N C C C C C C C C C C C C C C C C C H H H H H H H H H H H H H H H H H H H
charge: 0
multiplicity: 1
keywords: wb97x-d3
keywords: def2-TZVPP
keywords: def2/J RIJCOSX
keywords: DEFGRID2
keywords: scfconv7
keywords: smallprint printgap noloewdin
keywords: NOSOSCF
formula: C17H19NO4
InChI: InChI=1/C17H19NO4/c1-2-20-17(19)18-12-13-21-14-8-10-16(11-9-14)22-15-6-4-3-5-7-15/h3-11,18H,2,12-13H2,1H3
41 atoms
O  -1.921881 -0.98724 0.580703
O  3.14619 -2.899789 -0.397278
O  -5.098967 3.539802 -0.439853
O  -4.092535 2.844181 1.459363
N  -4.543779 1.412032 -0.245598
C  -2.439214 0.170346 -0.049726
C  -3.905663 0.259029 0.337205
C  -0.65219 -1.369906 0.310976
C  1.919182 -2.332187 -0.141606
C  -0.212611 -2.533132 0.940654
C  0.211216 -0.687094 -0.540274
C  1.068026 -3.006783 0.722753
C  1.491922 -1.175049 -0.770895
C  4.28458 -2.140018 -0.378717
C  -4.53393 2.618919 0.345923
C  4.441784 -1.024075 0.434774
C  5.326249 -2.574982 -1.189101
C  -5.227496 4.876189 0.063432
C  5.652724 -0.344345 0.423704
C  6.532205 -1.890878 -1.181608
C  6.701299 -0.769248 -0.380475
C  -3.949745 5.672862 -0.061606
H  -1.899504 1.065708 0.277767
H  -2.347669 0.09814 -1.138638
H  -4.431413 -0.629159 -0.01133
H  -4.012741 0.290911 1.420676
H  -0.879351 -3.066942 1.605983
H  -0.090593 0.220904 -1.043962
H  1.400387 -3.911278 1.21605
H  2.143636 -0.640657 -1.450548
H  -4.869415 1.342427 -1.197496
H  3.639535 -0.682926 1.076279
H  5.191527 -3.447543 -1.815798
H  -5.587808 4.860282 1.093122
H  -6.009865 5.320118 -0.550046
H  5.77305 0.525296 1.056398
H  7.340687 -2.235796 -1.812894
H  7.641099 -0.233791 -0.380634
H  -3.588003 5.683867 -1.089986
H  -4.147134 6.704836 0.23012
H  -3.157491 5.292688 0.581775
elementType: O N C H
totalener: -1015.01956913 hartree
nucrepener: 1621.86293526 hartree
electener: -2636.88250439 hartree
oneelecener: -4601.94000767 hartree
twoeener: 1965.05750328 hartree
cpcmener: -0.03782817 hartree
kineticenergy: 1010.61872312 hartree
xcener: -97.180538184107 hartree
chargesum: 0.0000000
charge: -0.340545 -0.346109 -0.338255 -0.570389 -0.246014 0.034204 -0.026807 0.297903 0.240356 -0.226446 -0.185743 -0.207204 -0.220956 0.303726 0.540413 -0.201186 -0.261874 0.045096 -0.154345 -0.123271 -0.197135 -0.252150 0.105987 0.099374 0.107867 0.092784 0.142752 0.144496 0.148039 0.160847 0.182087 0.156868 0.147313 0.088838 0.107540 0.162703 0.161296 0.160763 0.086365 0.095586 0.085225
qa: -0.3405 -0.3461 -0.3383 -0.5704 -0.2460 0.0342 -0.0268 0.2979 0.2404 -0.2264 -0.1857 -0.2072 -0.2210 0.3037 0.5404 -0.2012 -0.2619 0.0451 -0.1543 -0.1233 -0.1971 -0.2521 0.1060 0.0994 0.1079 0.0928 0.1428 0.1445 0.1480 0.1608 0.1821 0.1569 0.1473 0.0888 0.1075 0.1627 0.1613 0.1608 0.0864 0.0956 0.0852
va: 2.0590 2.0504 2.0697 1.9227 3.2004 3.8001 3.8666 3.7860 3.7161 3.9953 3.8504 4.0222 3.9895 3.6743 4.2786 3.8927 3.9973 3.8589 3.8948 3.8822 3.9015 3.9090 0.9992 0.9927 1.0071 1.0236 1.0086 1.0097 1.0041 0.9953 1.0127 0.9983 1.0087 1.0105 0.9958 0.9892 0.9878 0.9897 1.0049 1.0076 1.0157
dispcorr: -0.015551120 hartree
energy: -1015.035120250967
dipole: -7.64211 6.97793 -0.66418 15.49840 -14.64547 0.85293 -1.82509 0.18287 -1.64223
magnitude: 1.96610 au
magnitude: 4.99742 debye
