program: Orca
programVersion: 5.0.2
elementType: O O O O N C C C C C C C C C C C C C C C C C H H H H H H H H H H H H H H H H H H H
charge: 0
multiplicity: 1
keywords: wb97x-d3
keywords: def2-TZVPP
keywords: def2/J RIJCOSX
keywords: DEFGRID2
keywords: scfconv7
keywords: smallprint printgap noloewdin
keywords: NOSOSCF
formula: C17H19NO4
InChI: InChI=1/C17H19NO4/c1-2-20-17(19)18-12-13-21-14-8-10-16(11-9-14)22-15-6-4-3-5-7-15/h3-11,18H,2,12-13H2,1H3
41 atoms
O  -1.467772 -0.477541 -0.729339
O  3.743876 -0.981131 0.980955
O  -5.811305 2.939038 0.198501
O  -5.242746 0.946036 1.096803
N  -4.460294 1.602134 -0.930599
C  -2.222767 0.697074 -0.493634
C  -3.586083 0.472509 -1.12595
C  -0.192481 -0.538583 -0.282371
C  2.449495 -0.850518 0.528114
C  0.471114 0.506011 0.350056
C  0.472659 -1.747982 -0.489037
C  1.796609 0.347632 0.743189
C  1.782062 -1.908172 -0.080737
C  4.696068 -1.491551 0.137568
C  -5.168063 1.768118 0.199856
C  4.661886 -1.300439 -1.239075
C  5.742493 -2.189157 0.727493
C  -6.610772 3.270577 1.342654
C  5.67815 -1.830449 -2.021975
C  6.756355 -2.702914 -0.067619
C  6.72659 -2.534481 -1.445596
C  -5.783623 3.791229 2.494451
H  -2.323254 0.883638 0.581186
H  -1.740629 1.570175 -0.94574
H  -3.474801 0.314783 -2.19809
H  -4.050481 -0.424263 -0.716858
H  -0.012412 1.454916 0.53728
H  -0.046539 -2.568839 -0.967378
H  2.313329 1.169244 1.22256
H  2.277581 -2.857434 -0.240804
H  -4.390714 2.3743 -1.575499
H  3.85731 -0.746665 -1.7054
H  5.760806 -2.328759 1.800958
H  -7.216897 2.414726 1.642863
H  -7.289191 4.042886 0.983626
H  5.646545 -1.684463 -3.093765
H  7.568587 -3.247703 0.395588
H  7.513246 -2.945743 -2.063738
H  -5.190537 4.65679 2.198884
H  -6.452296 4.106631 3.296199
H  -5.114758 3.033818 2.901398
elementType: O N C H
totalener: -1015.02019241 hartree
nucrepener: 1620.21128761 hartree
electener: -2635.23148002 hartree
oneelecener: -4598.69038974 hartree
twoeener: 1963.45890972 hartree
cpcmener: -0.03810776 hartree
kineticenergy: 1010.62020383 hartree
xcener: -97.180811060948 hartree
chargesum: -0.0000000
charge: -0.339243 -0.348785 -0.338072 -0.570455 -0.247004 0.031359 -0.024020 0.304742 0.241743 -0.179046 -0.242482 -0.268446 -0.158203 0.287340 0.539269 -0.190872 -0.249422 0.047124 -0.159052 -0.129216 -0.192885 -0.253069 0.104922 0.099982 0.108273 0.092511 0.144230 0.142929 0.148693 0.159544 0.182698 0.157995 0.147811 0.089057 0.107435 0.162562 0.160482 0.161693 0.087248 0.095388 0.085241
qa: -0.3392 -0.3488 -0.3381 -0.5705 -0.2470 0.0314 -0.0240 0.3047 0.2417 -0.1790 -0.2425 -0.2684 -0.1582 0.2873 0.5393 -0.1909 -0.2494 0.0471 -0.1591 -0.1292 -0.1929 -0.2531 0.1049 0.1000 0.1083 0.0925 0.1442 0.1429 0.1487 0.1595 0.1827 0.1580 0.1478 0.0891 0.1074 0.1626 0.1605 0.1617 0.0872 0.0954 0.0852
va: 2.0596 2.0444 2.0722 1.9221 3.2019 3.7944 3.8684 3.7834 3.7129 3.8386 4.0052 4.0646 3.9415 3.6792 4.2802 3.8808 3.9921 3.8546 3.8987 3.8888 3.8956 3.9109 1.0009 0.9919 1.0073 1.0228 1.0088 1.0101 1.0074 0.9927 1.0123 0.9969 1.0078 1.0113 0.9959 0.9895 0.9882 0.9892 1.0047 1.0077 1.0155
dispcorr: -0.015690460 hartree
energy: -1015.035882867636
dipole: -11.56820 11.33510 -0.23310 8.95460 -7.43136 1.52324 1.64103 -2.98996 -1.34893
magnitude: 2.04798 au
magnitude: 5.20554 debye
