program: Orca
programVersion: 5.0.2
elementType: O O O O N C C C C C C C C C C C C C C C C C H H H H H H H H H H H H H H H H H H H
charge: 0
multiplicity: 1
keywords: wb97x-d3
keywords: def2-TZVPP
keywords: def2/J RIJCOSX
keywords: DEFGRID2
keywords: scfconv7
keywords: smallprint printgap noloewdin
keywords: NOSOSCF
formula: C17H19NO4
InChI: InChI=1/C17H19NO4/c1-2-20-17(19)18-12-13-21-14-8-10-16(11-9-14)22-15-6-4-3-5-7-15/h3-11,18H,2,12-13H2,1H3
41 atoms
O  -1.514178 -0.602146 -0.472721
O  3.97915 -0.207446 -0.389025
O  -5.954487 2.380314 1.306216
O  -5.034578 2.197177 -0.748727
N  -4.680943 0.633328 0.862288
C  -2.323912 0.257119 0.310418
C  -3.763336 -0.181936 0.10604
C  -0.168775 -0.475081 -0.395732
C  2.612807 -0.364665 -0.374221
C  0.581318 -1.35071 -1.181542
C  0.487699 0.456449 0.400624
C  1.962484 -1.294262 -1.178912
C  1.877233 0.499337 0.415097
C  4.805387 -1.297826 -0.340865
C  -5.202591 1.77493 0.382451
C  4.490664 -2.456924 0.358782
C  6.027711 -1.173973 -0.989233
C  -6.628116 3.594922 0.947652
C  5.412438 -3.494701 0.396765
C  6.941667 -2.215332 -0.933417
C  6.638135 -3.382662 -0.245315
C  -5.727765 4.805374 1.02491
H  -2.061196 0.181377 1.371385
H  -2.194132 1.30039 0.001744
H  -4.027736 -0.144714 -0.95037
H  -3.88321 -1.215431 0.431695
H  0.075529 -2.074901 -1.807911
H  -0.054715 1.155954 1.021536
H  2.521226 -1.973434 -1.810281
H  2.381602 1.225816 1.039464
H  -4.824799 0.406666 1.834126
H  3.545342 -2.558485 0.876065
H  6.261247 -0.265579 -1.52982
H  -7.435197 3.678534 1.673504
H  -7.082093 3.49887 -0.039445
H  5.166431 -4.396928 0.941535
H  7.892893 -2.112817 -1.438978
H  7.350342 -4.195898 -0.208188
H  -5.273726 4.900888 2.011391
H  -4.936148 4.782778 0.277454
H  -6.32489 5.70065 0.848224
elementType: O N C H
totalener: -1015.01986329 hartree
nucrepener: 1613.38964361 hartree
electener: -2628.40950690 hartree
oneelecener: -4585.02697147 hartree
twoeener: 1956.61746457 hartree
cpcmener: -0.03805565 hartree
kineticenergy: 1010.61327422 hartree
xcener: -97.179791146364 hartree
chargesum: -0.0000000
charge: -0.340365 -0.345703 -0.338280 -0.571128 -0.243710 0.035641 -0.026884 0.301408 0.259764 -0.243776 -0.171588 -0.165315 -0.284298 0.301799 0.539450 -0.201368 -0.261315 0.045239 -0.152241 -0.122205 -0.197692 -0.252034 0.099051 0.104563 0.092621 0.107864 0.143564 0.143701 0.158628 0.148745 0.182124 0.157612 0.147507 0.107116 0.089077 0.162893 0.160836 0.161201 0.086985 0.084955 0.095556
qa: -0.3404 -0.3457 -0.3383 -0.5711 -0.2437 0.0356 -0.0269 0.3014 0.2598 -0.2438 -0.1716 -0.1653 -0.2843 0.3018 0.5394 -0.2014 -0.2613 0.0452 -0.1522 -0.1222 -0.1977 -0.2520 0.0991 0.1046 0.0926 0.1079 0.1436 0.1437 0.1586 0.1487 0.1821 0.1576 0.1475 0.1071 0.0891 0.1629 0.1608 0.1612 0.0870 0.0850 0.0956
va: 2.0593 2.0493 2.0696 1.9218 3.2002 3.7985 3.8689 3.7885 3.7013 4.0096 3.8342 3.9446 4.0671 3.6693 4.2797 3.8990 4.0005 3.8584 3.8940 3.8826 3.9013 3.9101 0.9924 0.9995 1.0234 1.0071 1.0100 1.0092 0.9937 1.0084 1.0127 0.9975 1.0085 0.9959 1.0108 0.9892 0.9881 0.9896 1.0045 1.0155 1.0077
dispcorr: -0.015522152 hartree
energy: -1015.035385440588
dipole: -12.34791 11.70192 -0.64599 7.37933 -7.86018 -0.48085 4.48707 -2.64981 1.83726
magnitude: 2.00600 au
magnitude: 5.09885 debye
