program: Orca
programVersion: 5.0.2
elementType: O O O O N C C C C C C C C C C C C C C C C C H H H H H H H H H H H H H H H H H H H
charge: 0
multiplicity: 1
keywords: wb97x-d3
keywords: def2-TZVPP
keywords: def2/J RIJCOSX
keywords: DEFGRID2
keywords: scfconv7
keywords: smallprint printgap noloewdin
keywords: NOSOSCF
formula: C17H19NO4
InChI: InChI=1/C17H19NO4/c1-2-20-17(19)18-12-13-21-14-8-10-16(11-9-14)22-15-6-4-3-5-7-15/h3-11,18H,2,12-13H2,1H3
41 atoms
O  -2.113508 -0.441286 -0.161462
O  3.17808 -1.353476 1.058031
O  -4.265759 2.947046 0.212254
O  -4.720629 0.913794 1.07616
N  -4.220718 1.189974 -1.127221
C  -2.657183 -0.694429 -1.444996
C  -4.091099 -0.210786 -1.44801
C  -0.80037 -0.68637 0.050764
C  1.879162 -1.119077 0.669743
C  -0.255954 -0.175161 1.227525
C  0.009786 -1.416056 -0.813452
C  1.076876 -0.383912 1.531868
C  1.344105 -1.639206 -0.497335
C  4.191342 -1.29192 0.137223
C  -4.413299 1.621066 0.13256
C  5.257698 -2.161389 0.324467
C  4.202484 -0.374995 -0.907692
C  -4.466951 3.570064 1.488222
C  6.34038 -2.113858 -0.541603
C  5.286852 -0.348267 -1.773237
C  6.358342 -1.213693 -1.598171
C  -3.270025 3.42589 2.399531
H  -2.076442 -0.172625 -2.213722
H  -2.644633 -1.763408 -1.681194
H  -4.500987 -0.387784 -2.441897
H  -4.69271 -0.795414 -0.754702
H  -0.880496 0.397691 1.901949
H  -0.376446 -1.834702 -1.732754
H  1.491957 0.023995 2.44464
H  1.952836 -2.223773 -1.175386
H  -3.879288 1.853466 -1.806944
H  5.239048 -2.868623 1.144116
H  3.380681 0.314603 -1.052204
H  -5.374335 3.188583 1.958937
H  -4.636825 4.619475 1.252205
H  7.168983 -2.793385 -0.39091
H  5.292427 0.364127 -2.587874
H  7.199948 -1.184314 -2.277035
H  -3.444432 4.00706 3.305752
H  -3.094708 2.392947 2.698066
H  -2.364416 3.809519 1.929232
elementType: O N C H
totalener: -1015.02020574 hartree
nucrepener: 1683.44610213 hartree
electener: -2698.46630787 hartree
oneelecener: -4725.77047315 hartree
twoeener: 2027.30416528 hartree
cpcmener: -0.04291508 hartree
kineticenergy: 1010.63020316 hartree
xcener: -97.183365182700 hartree
chargesum: -0.0000000
charge: -0.340266 -0.348225 -0.336644 -0.569017 -0.231673 0.029679 -0.038538 0.272621 0.256665 -0.201179 -0.184672 -0.227942 -0.217106 0.299768 0.524404 -0.257906 -0.200666 0.047923 -0.123658 -0.150771 -0.194911 -0.253354 0.109418 0.102450 0.108348 0.099476 0.148332 0.145516 0.146533 0.158456 0.175228 0.147140 0.158147 0.088511 0.107073 0.160683 0.162685 0.161096 0.097499 0.081446 0.087430
qa: -0.3403 -0.3482 -0.3366 -0.5690 -0.2317 0.0297 -0.0385 0.2726 0.2567 -0.2012 -0.1847 -0.2279 -0.2171 0.2998 0.5244 -0.2579 -0.2007 0.0479 -0.1237 -0.1508 -0.1949 -0.2534 0.1094 0.1025 0.1083 0.0995 0.1483 0.1455 0.1465 0.1585 0.1752 0.1471 0.1581 0.0885 0.1071 0.1607 0.1627 0.1611 0.0975 0.0814 0.0874
va: 2.0596 2.0492 2.0670 1.9226 3.1863 3.8342 3.9074 3.8172 3.6996 3.9551 3.8847 4.0355 3.9772 3.6721 4.3113 4.0011 3.8998 3.8546 3.8810 3.8907 3.9006 3.9062 0.9940 0.9943 1.0051 1.0243 1.0005 1.0052 1.0061 0.9959 1.0146 1.0082 0.9966 1.0110 0.9962 0.9881 0.9892 0.9895 1.0086 1.0155 1.0047
dispcorr: -0.016683442 hartree
energy: -1015.036889178029
dipole: -5.99038 6.29538 0.30500 6.90390 -6.25352 0.65038 -1.65388 -0.71079 -2.36467
magnitude: 2.47137 au
magnitude: 6.28172 debye
