program: Gaussian 09
title: 000006599
version: EM64L-G09RevD.01
frameworkgroup: C1[X(C3H7NS2)]
method: RPBEPBE
basis: SDD
operation: Freq
keyword: #pfreq=noraman
keyword: PBEPBE/SDD
title: #p freq=noraman PBEPBE/SDD
converged: NO YES NO NO
title: Mulliken charges:
elementType: S S N C C C H H H H H H H
charge: 0.006679 0.019833 0.029342 -0.609215 -0.622164 -0.496364 0.236837 0.237637 0.274073 0.262886 0.262958 0.237685 0.159813
chargesum: 0.00000
title: Mulliken charges with hydrogens summed into heavy atoms:
elementType: S S N C C C
charge: 0.166492 0.019833 0.029342 0.139333 0.141364 -0.496364
polarizability: 8.94493484e+01 -5.31581033e+00 9.08303112e+01 2.54468445e-03 6.20730982e-02 3.69437941e+01
1716.lowfreq: -16.2307 -15.5452 -6.1016 -0.0030 -0.0029 -0.0013 55.1100 80.1152 116.5635
frequency: 54.7335 80.0678 116.5448 243.8570 251.0468 298.8083 310.4651 386.6198 413.1105 536.0203 537.7204 804.1981 879.4903 969.5311 1050.9674 1083.6559 1135.2122 1144.5995 1246.5483 1385.8503 1423.2675 1453.8022 1468.3793 1476.7527 1484.5875 1506.1613 2471.7766 2975.6779 2982.2356 3062.2226 3062.6936 3113.3905 3116.6776
redmass: 1.3530 1.1200 1.9006 2.5021 4.7897 8.1960 1.1046 4.1881 3.6440 9.2889 4.8731 1.6205 2.8005 3.2344 1.5240 1.2251 1.3635 1.8894 3.9981 2.0517 1.1437 1.1343 1.0416 1.0746 1.0437 1.5660 1.0377 1.0340 1.0357 1.1018 1.1024 1.0991 1.0994
irintensity: 0.0098 0.0689 0.0600 19.2185 0.2018 3.2971 31.3440 16.5729 11.0064 0.5447 3.5640 23.1720 54.5124 118.9092 20.4962 0.1242 0.6762 78.7358 51.8970 86.7580 23.1051 6.4141 25.2447 11.5182 7.2077 160.7708 2.7040 43.3742 42.8298 7.6177 40.0182 7.4500 9.9793
temp: 298.150 k
press: 1.00000 atm
elementType: 16 16 7 6 6 6 1 1 1 1 1 1 1
symmnumber: 1
zpe: 254366.0 jmol-1
zpe.correction: 0.096883 hartree
zpe.thermalcorrener: 0.105174 hartree
zpe.thermalcorrenthalpy: 0.106118 hartree
zpe.thermalcorrgfe: 0.063124 hartree
zpe.sumelectzpe: -968.891541 hartree
zpe.sumelectthermal: -968.883250 hartree
zpe.sumelectthermalent: -968.882306 hartree
zpe.sumelectthermalfe: -968.925300 hartree
dipole: 3.5741 -2.0476 0.0010
dipole: 4.1191
quadrupole: -43.8624 -54.7023 -53.8702
quadrupole: 2.4402 0.0010 -0.0155
quadrupole: 6.9493 -3.8907 -3.0586 2.4402 0.0010 -0.0155
hfenergy: -968.988424 hartree
pointgroup: C01 [X(C3H7N1S2)]
dipole: -1.4719629 -0.6778587 0.0068344 debye
dipolederiv: -0.0766171 0.318525 -0.0049325 0.3882166 -0.7332066 0.0105431 -0.0059234 0.0101375 -0.1387483 -0.5405673 -0.2529391 0.0032675 -0.2445778 -0.8422489 0.0097064 0.0033954 0.0092842 -0.208645 -1.2866339 -0.1776369 -0.0003115 0.0583924 -0.592812 0.0082658 -0.0003975 0.0052113 -0.188587 0.1403158 -0.1267352 0.0024918 -0.4009301 0.1878159 -0.0029095 0.0027927 -0.002525 0.2432022 0.1750173 0.0990871 -0.0016962 0.2236856 0.2815419 -0.0019252 -0.0037481 -0.0017427 0.2287573 1.4573875 0.1930006 0.0006189 0.0447257 1.4094012 -0.0266407 0.0027034 -0.0259203 -0.1737287 -0.0446298 0.0614768 0.1004685 0.0547852 0.0867416 0.0398994 0.1400493 -0.0089669 -0.061997 -0.0383797 0.0600394 -0.0990659 0.0572159 0.0846395 -0.0400674 -0.1408565 0.0098243 -0.0687566 0.1603926 -0.1669865 -0.0010151 -0.0067272 0.0118798 0.000047 -0.0010427 0.0004696 0.129126 0.0821214 0.0202768 -0.0593681 -0.0642868 -0.0112662 0.0628366 -0.0192062 0.0868781 -0.0462448 0.0815042 0.0248267 0.0612315 -0.0611521 -0.0156721 -0.0639676 0.0240214 -0.0863519 -0.0389022 -0.1194603 -0.0011725 -0.0021776 0.0857268 0.0800109 0.0020054 -0.0035058 0.0011792 0.1225019 0.0095494 -0.0517622 0.0004884 -0.1350744 0.053175 0.0022066 0.0017179 0.0025225 0.2020222 unknown
polarizability: 90.3977985|5.3555709|89.8671319|0.0350507|-0.8763962|36.9585234 unknown
InChI: InChI=1S/C3H7NS2/c1-4(2)3(5)6/h5H,1-2H3
charge 0 multiplicity 1
13 atoms
S  1.402677 -1.604427 0.035899
S  1.598562 1.501515 -0.014392
N  -0.737838 0.04169 0.004692
C  -1.553019 1.273912 -0.014735
C  -1.47876 -1.239503 0.020125
C  0.633008 0.095232 0.006544
H  -2.207165 1.309104 0.876089
H  -2.178464 1.301454 -0.926442
H  -0.881183 2.145059 -0.008621
H  -1.245959 -1.822651 0.930281
H  -1.22927 -1.853385 -0.864927
H  -2.558086 -1.025402 0.005843
H  2.684998 -1.095998 0.030146
