program: Orca
programVersion: 5.0.2
elementType: O O O O N C C C C C C C C C C C C C C C C C H H H H H H H H H H H H H H H H H H H
charge: 0
multiplicity: 1
keywords: wb97x-d3
keywords: def2-TZVPP
keywords: def2/J RIJCOSX
keywords: DEFGRID2
keywords: scfconv7
keywords: smallprint printgap noloewdin
keywords: NOSOSCF
formula: C17H19NO4
InChI: InChI=1/C17H19NO4/c1-2-20-17(19)18-12-13-21-14-8-10-16(11-9-14)22-15-6-4-3-5-7-15/h3-11,18H,2,12-13H2,1H3
41 atoms
O  -1.500951 -0.427292 -0.80567
O  3.562578 -1.721626 0.941308
O  -6.000939 2.528432 0.969576
O  -4.493545 3.013339 -0.643332
N  -4.773234 0.896085 0.137624
C  -2.402652 0.267137 0.038707
C  -3.751019 0.271892 -0.664141
C  -0.254502 -0.693428 -0.344032
C  2.329578 -1.35985 0.451728
C  0.271182 -0.172052 0.832583
C  0.527438 -1.549187 -1.11999
C  1.564152 -0.501724 1.22068
C  1.808502 -1.887983 -0.724335
C  4.646269 -1.817299 0.109478
C  -5.036703 2.213593 0.098127
C  5.589624 -2.784995 0.432051
C  4.84864 -0.965292 -0.969941
C  -6.43236 3.89336 1.048409
C  6.743648 -2.897408 -0.32857
C  6.004444 -1.097023 -1.728149
C  6.955401 -2.058752 -1.414896
C  -5.51381 4.746586 1.892069
H  -2.488513 -0.235998 1.007867
H  -2.064504 1.293449 0.217603
H  -3.676313 0.78023 -1.624901
H  -4.063249 -0.752209 -0.866232
H  -0.301429 0.496561 1.460637
H  0.120503 -1.965029 -2.033078
H  1.967805 -0.091802 2.137705
H  2.389371 -2.570812 -1.331513
H  -5.24016 0.333416 0.831886
H  5.419644 -3.440083 1.277204
H  4.122792 -0.20212 -1.2200
H  -7.419435 3.837187 1.505001
H  -6.557117 4.311887 0.048594
H  7.476523 -3.651042 -0.071574
H  6.161982 -0.43356 -2.568449
H  7.853805 -2.152021 -2.010147
H  -5.96566 5.73045 2.022768
H  -5.370067 4.3151 2.882883
H  -4.538103 4.888571 1.429292
elementType: O N C H
totalener: -1015.01968920 hartree
nucrepener: 1611.50084800 hartree
electener: -2626.52053720 hartree
oneelecener: -4581.25910777 hartree
twoeener: 1954.73857057 hartree
cpcmener: -0.03755529 hartree
kineticenergy: 1010.59945203 hartree
xcener: -97.177167488595 hartree
chargesum: -0.0000000
charge: -0.342772 -0.345290 -0.338726 -0.569977 -0.242626 0.041490 -0.031075 0.291838 0.263878 -0.169201 -0.237482 -0.283185 -0.168788 0.301658 0.540223 -0.260807 -0.202001 0.044820 -0.123129 -0.151533 -0.194963 -0.252793 0.100570 0.099421 0.093089 0.106469 0.144086 0.143269 0.148170 0.158218 0.182958 0.147569 0.157884 0.106834 0.088786 0.160659 0.162623 0.161611 0.096175 0.086685 0.085366
qa: -0.3428 -0.3453 -0.3387 -0.5700 -0.2426 0.0415 -0.0311 0.2918 0.2639 -0.1692 -0.2375 -0.2832 -0.1688 0.3017 0.5402 -0.2608 -0.2020 0.0448 -0.1231 -0.1515 -0.1950 -0.2528 0.1006 0.0994 0.0931 0.1065 0.1441 0.1433 0.1482 0.1582 0.1830 0.1476 0.1579 0.1068 0.0888 0.1607 0.1626 0.1616 0.0962 0.0867 0.0854
va: 2.0552 2.0495 2.0685 1.9236 3.1959 3.7983 3.8778 3.7942 3.6995 3.8333 4.0065 4.0606 3.9422 3.6688 4.2770 3.9994 3.9040 3.8611 3.8814 3.8923 3.9002 3.9092 0.9956 0.9980 1.0210 1.0081 1.0083 1.0098 1.0087 0.9941 1.0125 1.0084 0.9973 0.9957 1.0105 0.9882 0.9892 0.9893 1.0075 1.0049 1.0149
dispcorr: -0.015501825 hartree
energy: -1015.035191022281
dipole: -11.62554 10.63275 -0.99279 9.86120 -10.38039 -0.51920 3.00781 -2.07559 0.93222
magnitude: 1.45747 au
magnitude: 3.70460 debye
