program: Orca
programVersion: 5.0.2
elementType: O O O O N C C C C C C C C C C C C C C C C C H H H H H H H H H H H H H H H H H H H
charge: 0
multiplicity: 1
keywords: wb97x-d3
keywords: def2-TZVPP
keywords: def2/J RIJCOSX
keywords: DEFGRID2
keywords: scfconv7
keywords: smallprint printgap noloewdin
keywords: NOSOSCF
formula: C17H19NO4
InChI: InChI=1/C17H19NO4/c1-2-20-17(19)18-12-13-21-14-8-10-16(11-9-14)22-15-6-4-3-5-7-15/h3-11,18H,2,12-13H2,1H3
41 atoms
O  -1.594986 -0.806147 0.533771
O  3.474651 -1.455028 -1.519052
O  -5.851191 2.843746 0.023995
O  -4.274387 2.609028 1.624762
N  -4.804925 0.908111 0.216379
C  -2.472934 0.177501 0.015525
C  -3.813432 -0.018704 0.703489
C  -0.348552 -0.900588 0.013825
C  2.236328 -1.26502 -0.949684
C  0.173274 -0.028011 -0.934105
C  0.43777 -1.955947 0.477867
C  1.468901 -0.210081 -1.405392
C  1.719758 -2.143213 -0.003182
C  4.566815 -1.687361 -0.726783
C  -4.917914 2.159747 0.692013
C  5.586188 -2.448738 -1.285457
C  4.699555 -1.160116 0.552391
C  -6.114904 4.196226 0.421657
C  6.743994 -2.681874 -0.558766
C  5.861368 -1.409781 1.270484
C  6.886939 -2.168805 0.723768
C  -5.111281 5.173325 -0.144292
H  -2.088607 1.184585 0.20946
H  -2.588648 0.060944 -1.067485
H  -4.179648 -1.027486 0.515865
H  -3.707617 0.088891 1.782793
H  -0.401646 0.803786 -1.316983
H  0.033753 -2.641855 1.211757
H  1.870103 0.474118 -2.142147
H  2.30588 -2.979574 0.356502
H  -5.328612 0.652436 -0.606373
H  5.471575 -2.852834 -2.28338
H  3.915641 -0.556321 0.99109
H  -6.170607 4.268376 1.508698
H  -7.108407 4.404109 0.027722
H  7.534908 -3.27536 -0.998468
H  5.96304 -0.997518 2.265925
H  7.788837 -2.356963 1.290518
H  -5.428012 6.187441 0.101632
H  -4.113213 5.029124 0.267623
H  -5.05401 5.099462 -1.230468
elementType: O N C H
totalener: -1015.02016019 hartree
nucrepener: 1617.77593954 hartree
electener: -2632.79609973 hartree
oneelecener: -4593.83878765 hartree
twoeener: 1961.04268791 hartree
cpcmener: -0.03761489 hartree
kineticenergy: 1010.61424191 hartree
xcener: -97.179841771562 hartree
chargesum: -0.0000000
charge: -0.340873 -0.346442 -0.338157 -0.570398 -0.244487 0.035698 -0.028426 0.302600 0.249029 -0.175234 -0.243171 -0.276155 -0.159927 0.298517 0.539424 -0.257916 -0.198070 0.046428 -0.125333 -0.155477 -0.195531 -0.253105 0.101599 0.100839 0.107364 0.094146 0.144978 0.143041 0.148623 0.159938 0.183346 0.147491 0.157111 0.088619 0.107652 0.160934 0.162570 0.160842 0.095665 0.085333 0.086918
qa: -0.3409 -0.3464 -0.3382 -0.5704 -0.2445 0.0357 -0.0284 0.3026 0.2490 -0.1752 -0.2432 -0.2762 -0.1599 0.2985 0.5394 -0.2579 -0.1981 0.0464 -0.1253 -0.1555 -0.1955 -0.2531 0.1016 0.1008 0.1074 0.0941 0.1450 0.1430 0.1486 0.1599 0.1833 0.1475 0.1571 0.0886 0.1077 0.1609 0.1626 0.1608 0.0957 0.0853 0.0869
va: 2.0587 2.0469 2.0715 1.9223 3.1985 3.7885 3.8739 3.7850 3.7071 3.8338 4.0077 4.0676 3.9473 3.6720 4.2784 3.9956 3.8894 3.8570 3.8850 3.8967 3.8981 3.9103 1.0000 0.9945 1.0081 1.0202 1.0085 1.0101 1.0081 0.9929 1.0121 1.0083 0.9977 1.0112 0.9957 0.9879 0.9894 0.9895 1.0077 1.0152 1.0046
dispcorr: -0.015598559 hartree
energy: -1015.035758746961
dipole: -10.78419 9.65500 -1.12919 10.96709 -10.97653 -0.00944 0.78808 -1.77834 -0.99026
magnitude: 1.50192 au
magnitude: 3.81758 debye
