program: Orca
programVersion: 5.0.2
elementType: O O O O N C C C C C C C C C C C C C C C C C H H H H H H H H H H H H H H H H H H H
charge: 0
multiplicity: 1
keywords: wb97x-d3
keywords: def2-TZVPP
keywords: def2/J RIJCOSX
keywords: DEFGRID2
keywords: scfconv7
keywords: smallprint printgap noloewdin
keywords: NOSOSCF
formula: C17H19NO4
InChI: InChI=1/C17H19NO4/c1-2-20-17(19)18-12-13-21-14-8-10-16(11-9-14)22-15-6-4-3-5-7-15/h3-11,18H,2,12-13H2,1H3
41 atoms
O  -1.944088 -0.065453 -0.717987
O  3.363714 -0.163897 0.741828
O  -4.827862 1.982019 1.205736
O  -4.293362 2.038829 -0.985308
N  -4.676947 0.074914 0.100522
C  -2.75321 -1.228221 -0.723866
C  -4.188117 -0.798993 -0.939738
C  -0.640793 -0.176936 -0.374997
C  2.052932 -0.20684 0.325233
C  0.015829 -1.385885 -0.165381
C  0.064893 1.016393 -0.230895
C  1.357909 -1.397197 0.192803
C  1.40597 1.001339 0.106736
C  4.294026 -0.993087 0.173577
C  -4.561576 1.413915 0.025012
C  4.232556 -1.400565 -1.153903
C  5.356137 -1.379695 0.981668
C  -4.751461 3.411042 1.297996
C  5.240627 -2.208662 -1.661851
C  6.361074 -2.178355 0.456323
C  6.306406 -2.602709 -0.864519
C  -3.330101 3.907534 1.430393
H  -2.454676 -1.913088 -1.524466
H  -2.663765 -1.763275 0.227788
H  -4.304417 -0.3136 -1.906691
H  -4.804411 -1.696602 -0.965184
H  -0.496114 -2.332646 -0.268683
H  -0.442341 1.960115 -0.388563
H  1.847126 -2.347101 0.367514
H  1.945952 1.933204 0.215221
H  -4.793847 -0.331477 1.016955
H  3.414881 -1.093967 -1.793323
H  5.395143 -1.05305 2.0132
H  -5.32084 3.655446 2.19311
H  -5.257907 3.874738 0.450658
H  5.189613 -2.526765 -2.694911
H  7.186523 -2.476028 1.089676
H  7.087607 -3.232008 -1.269148
H  -2.828483 3.452941 2.284244
H  -2.737379 3.714658 0.537361
H  -3.344938 4.985808 1.591393
elementType: O N C H
totalener: -1015.02066101 hartree
nucrepener: 1683.07848446 hartree
electener: -2698.09914547 hartree
oneelecener: -4725.06615054 hartree
twoeener: 2026.96700507 hartree
cpcmener: -0.04282929 hartree
kineticenergy: 1010.63501786 hartree
xcener: -97.183933780067 hartree
chargesum: 0.0000000
charge: -0.338362 -0.347164 -0.336239 -0.566693 -0.232736 0.026719 -0.036050 0.292039 0.243511 -0.186577 -0.213311 -0.216773 -0.218136 0.298322 0.522343 -0.196724 -0.258524 0.047268 -0.155049 -0.124716 -0.195926 -0.250795 0.107135 0.105418 0.099720 0.108056 0.145263 0.147026 0.160385 0.147067 0.174104 0.157079 0.146830 0.107305 0.088231 0.162459 0.160879 0.161404 0.087582 0.080159 0.097473
qa: -0.3384 -0.3472 -0.3362 -0.5667 -0.2327 0.0267 -0.0361 0.2920 0.2435 -0.1866 -0.2133 -0.2168 -0.2181 0.2983 0.5223 -0.1967 -0.2585 0.0473 -0.1550 -0.1247 -0.1959 -0.2508 0.1071 0.1054 0.0997 0.1081 0.1453 0.1470 0.1604 0.1471 0.1741 0.1571 0.1468 0.1073 0.0882 0.1625 0.1609 0.1614 0.0876 0.0802 0.0975
va: 2.0626 2.0478 2.0668 1.9247 3.1882 3.8296 3.9070 3.7975 3.7096 3.8703 3.9681 3.9841 4.0350 3.6763 4.3143 3.8891 3.9963 3.8547 3.8947 3.8823 3.8986 3.9081 0.9958 0.9925 1.0243 1.0057 1.0067 1.0042 0.9949 1.0054 1.0154 0.9978 1.0086 0.9964 1.0113 0.9894 0.9880 0.9894 1.0048 1.0145 1.0086
dispcorr: -0.016756132 hartree
energy: -1015.037417143563
dipole: -7.15868 6.60971 -0.54898 2.29927 -4.15549 -1.85621 1.52411 -0.68240 0.84171
magnitude: 2.11078 au
magnitude: 5.36517 debye
