program: Orca
programVersion: 5.0.2
elementType: O O O O N C C C C C C C C C C C C C C C C C H H H H H H H H H H H H H H H H H H H
charge: 0
multiplicity: 1
keywords: wb97x-d3
keywords: def2-TZVPP
keywords: def2/J RIJCOSX
keywords: DEFGRID2
keywords: scfconv7
keywords: smallprint printgap noloewdin
keywords: NOSOSCF
formula: C17H19NO4
InChI: InChI=1/C17H19NO4/c1-2-20-17(19)18-12-13-21-14-8-10-16(11-9-14)22-15-6-4-3-5-7-15/h3-11,18H,2,12-13H2,1H3
41 atoms
O  -2.170182 -0.408465 -0.556709
O  2.897303 -1.762136 1.113703
O  -4.137593 2.795691 0.734886
O  -3.783439 2.137732 -1.393215
N  -4.660285 0.724546 0.162409
C  -3.277442 -1.261395 -0.322577
C  -4.539913 -0.481269 -0.623071
C  -0.943935 -0.802167 -0.145788
C  1.644584 -1.426567 0.649714
C  -0.612795 -2.110936 0.183922
C  0.03033 0.193824 -0.067447
C  0.686566 -2.419355 0.571884
C  1.3166 -0.113288 0.33152
C  4.002761 -1.409442 0.38701
C  -4.149341 1.898038 -0.256256
C  3.98249 -1.24951 -0.993535
C  5.186661 -1.253853 1.098005
C  -3.576233 4.087544 0.466177
C  5.158699 -0.92202 -1.654785
C  6.354242 -0.934903 0.421704
C  6.347025 -0.761605 -0.956264
C  -2.065713 4.076983 0.514602
H  -3.24251 -2.147801 -0.964298
H  -3.281578 -1.600199 0.719359
H  -4.596019 -0.229748 -1.68074
H  -5.390588 -1.128983 -0.411501
H  -1.341733 -2.908494 0.13353
H  -0.231059 1.216903 -0.309538
H  0.942132 -3.441205 0.821674
H  2.056361 0.674278 0.402458
H  -4.81748 0.611021 1.153327
H  3.067882 -1.379833 -1.557352
H  5.190629 -1.382725 2.172936
H  -3.975269 4.725897 1.252761
H  -3.94259 4.472648 -0.486237
H  5.139855 -0.797673 -2.729578
H  7.273086 -0.813523 0.980278
H  7.258308 -0.506025 -1.479901
H  -1.628784 3.469157 -0.277303
H  -1.698888 5.096218 0.389603
H  -1.702332 3.708933 1.474082
elementType: O N C H
totalener: -1015.02026245 hartree
nucrepener: 1695.84589903 hartree
electener: -2710.86616148 hartree
oneelecener: -4750.62980897 hartree
twoeener: 2039.76364748 hartree
cpcmener: -0.04267446 hartree
kineticenergy: 1010.63081479 hartree
xcener: -97.182673042820 hartree
chargesum: 0.0000000
charge: -0.341503 -0.347163 -0.335544 -0.566038 -0.232090 0.026527 -0.032924 0.269770 0.251129 -0.170696 -0.204027 -0.261363 -0.185673 0.294715 0.518170 -0.194632 -0.253285 0.048213 -0.160240 -0.127393 -0.195278 -0.253936 0.102776 0.107199 0.099906 0.107900 0.147544 0.155183 0.148257 0.158956 0.174507 0.156879 0.147157 0.107884 0.087997 0.162591 0.160415 0.161235 0.078488 0.099685 0.088702
qa: -0.3415 -0.3472 -0.3355 -0.5660 -0.2321 0.0265 -0.0329 0.2698 0.2511 -0.1707 -0.2040 -0.2614 -0.1857 0.2947 0.5182 -0.1946 -0.2533 0.0482 -0.1602 -0.1274 -0.1953 -0.2539 0.1028 0.1072 0.0999 0.1079 0.1475 0.1552 0.1483 0.1590 0.1745 0.1569 0.1472 0.1079 0.0880 0.1626 0.1604 0.1612 0.0785 0.0997 0.0887
va: 2.0591 2.0459 2.0668 1.9249 3.1877 3.8367 3.9061 3.8250 3.6960 3.8646 3.9486 4.0631 3.9775 3.6767 4.3208 3.8798 3.9911 3.8532 3.9019 3.8889 3.8977 3.9050 0.9941 0.9941 1.0232 1.0056 1.0023 0.9965 1.0068 0.9952 1.0150 0.9985 1.0084 0.9962 1.0117 0.9896 0.9882 0.9894 1.0149 1.0091 1.0044
dispcorr: -0.017118677 hartree
energy: -1015.037381128784
dipole: -4.83000 4.04708 -0.78292 7.01444 -7.73066 -0.71623 -0.10582 1.19462 1.08879
magnitude: 1.52033 au
magnitude: 3.86438 debye
