program: Orca
programVersion: 5.0.2
elementType: O O O O N C C C C C C C C C C C C C C C C C H H H H H H H H H H H H H H H H H H H
charge: 0
multiplicity: 1
keywords: wb97x-d3
keywords: def2-TZVPP
keywords: def2/J RIJCOSX
keywords: DEFGRID2
keywords: scfconv7
keywords: smallprint printgap noloewdin
keywords: NOSOSCF
formula: C17H19NO4
InChI: InChI=1/C17H19NO4/c1-2-20-17(19)18-12-13-21-14-8-10-16(11-9-14)22-15-6-4-3-5-7-15/h3-11,18H,2,12-13H2,1H3
41 atoms
O  -2.633753 -1.692725 0.190338
O  2.519179 0.207701 0.602013
O  -3.728915 2.188074 0.847328
O  -2.098164 1.84704 -0.669771
N  -4.026455 0.632907 -0.696549
C  -3.366205 -1.729827 -1.022209
C  -3.595671 -0.360516 -1.649982
C  -1.350885 -1.253019 0.201896
C  1.26301 -0.329468 0.438346
C  -0.844237 -0.879466 1.444122
C  -0.534468 -1.167225 -0.921043
C  0.460387 -0.434362 1.564923
C  0.764632 -0.691609 -0.803337
C  3.601505 -0.358235 -0.016795
C  -3.189361 1.566318 -0.204614
C  3.695814 -1.718453 -0.287792
C  4.652851 0.49637 -0.324568
C  -2.97875 3.245591 1.464007
C  4.848913 -2.211658 -0.883099
C  5.802655 -0.013702 -0.908698
C  5.905299 -1.367835 -1.198094
C  -1.884605 2.73717 2.373915
H  -2.903865 -2.393358 -1.760068
H  -4.322975 -2.173806 -0.747257
H  -2.70689 0.007213 -2.155502
H  -4.355756 -0.48634 -2.42295
H  -1.475818 -0.939819 2.321504
H  -0.890335 -1.450834 -1.902293
H  0.845375 -0.149862 2.53584
H  1.374996 -0.608021 -1.693533
H  -4.866487 0.435499 -0.17202
H  2.888456 -2.395614 -0.041149
H  4.570181 1.553183 -0.104172
H  -3.72003 3.798089 2.038952
H  -2.582171 3.920523 0.704158
H  4.91813 -3.270382 -1.096436
H  6.618516 0.656886 -1.14472
H  6.799806 -1.761349 -1.661781
H  -1.079117 2.248922 1.827574
H  -1.453814 3.58303 2.911009
H  -2.274927 2.03968 3.115433
elementType: O N C H
totalener: -1015.01734692 hartree
nucrepener: 1771.43418096 hartree
electener: -2786.45152788 hartree
oneelecener: -4902.55644594 hartree
twoeener: 2116.10491805 hartree
cpcmener: -0.04245530 hartree
kineticenergy: 1010.62533214 hartree
xcener: -97.185658732544 hartree
chargesum: 0.0000000
charge: -0.356621 -0.346135 -0.333395 -0.560275 -0.220464 0.021219 -0.064592 0.257356 0.289110 -0.203456 -0.171099 -0.246822 -0.217382 0.309038 0.515556 -0.204598 -0.263800 0.046707 -0.151956 -0.121959 -0.197866 -0.257023 0.102223 0.120389 0.113132 0.115987 0.142670 0.146766 0.146320 0.159878 0.174311 0.156093 0.147074 0.108349 0.089973 0.162525 0.160758 0.160510 0.077451 0.105112 0.088935
qa: -0.3566 -0.3461 -0.3334 -0.5603 -0.2205 0.0212 -0.0646 0.2574 0.2891 -0.2035 -0.1711 -0.2468 -0.2174 0.3090 0.5156 -0.2046 -0.2638 0.0467 -0.1520 -0.1220 -0.1979 -0.2570 0.1022 0.1204 0.1131 0.1160 0.1427 0.1468 0.1463 0.1599 0.1743 0.1561 0.1471 0.1083 0.0900 0.1625 0.1608 0.1605 0.0775 0.1051 0.0889
va: 2.0290 2.0499 2.0681 1.9268 3.1879 3.8694 3.8443 3.7261 3.6533 3.9406 3.8130 3.9802 3.9651 3.6714 4.3127 3.8929 3.9999 3.8575 3.8910 3.8806 3.9018 3.8977 1.0006 0.9923 1.0174 1.0086 1.0087 1.0032 1.0051 0.9947 1.0154 0.9986 1.0088 0.9966 1.0103 0.9893 0.9881 0.9898 1.0150 1.0089 1.0052
dispcorr: -0.019845628 hartree
energy: -1015.037192548553
dipole: -4.62204 3.08083 -1.54122 2.57576 -3.46982 -0.89406 0.67654 -1.11558 -0.43904
magnitude: 1.83506 au
magnitude: 4.66435 debye
