program: Orca
programVersion: 5.0.2
elementType: O O O O N C C C C C C C C C C C C C C C C C H H H H H H H H H H H H H H H H H H H
charge: 0
multiplicity: 1
keywords: wb97x-d3
keywords: def2-TZVPP
keywords: def2/J RIJCOSX
keywords: DEFGRID2
keywords: scfconv7
keywords: smallprint printgap noloewdin
keywords: NOSOSCF
formula: C17H19NO4
InChI: InChI=1/C17H19NO4/c1-2-20-17(19)18-12-13-21-14-8-10-16(11-9-14)22-15-6-4-3-5-7-15/h3-11,18H,2,12-13H2,1H3
41 atoms
O  -2.035759 -0.781819 -0.16753
O  3.135802 -2.575291 -0.763557
O  -4.303762 3.195561 -0.437901
O  -4.20823 2.578225 1.727446
N  -4.26646 1.040793 0.052002
C  -2.59063 -0.46086 1.097238
C  -4.048028 -0.116537 0.887207
C  -0.747944 -1.188425 -0.23361
C  1.870136 -2.067703 -0.566464
C  0.09353 -1.315697 0.868271
C  -0.26355 -1.50152 -1.502974
C  1.398207 -1.761672 0.698677
C  1.040863 -1.930687 -1.669748
C  4.221951 -1.891739 -0.2874
C  -4.24525 2.291907 0.542977
C  5.353209 -2.647809 -0.004526
C  4.237629 -0.511396 -0.126349
C  -4.379128 4.578534 -0.06696
C  6.503939 -2.017687 0.443716
C  5.39533 0.10336 0.331321
C  6.53059 -0.640644 0.62062
C  -4.419633 5.389013 -1.337138
H  -2.524138 -1.313182 1.781811
H  -2.056097 0.38049 1.551064
H  -4.565954 -0.963581 0.437442
H  -4.506059 0.043982 1.861832
H  -0.244358 -1.084213 1.868985
H  -0.913328 -1.402431 -2.363156
H  2.036359 -1.869992 1.56669
H  1.408205 -2.169419 -2.659572
H  -4.182924 0.920731 -0.946014
H  5.330161 -3.721991 -0.13629
H  3.365617 0.087525 -0.354408
H  -3.511313 4.851726 0.535491
H  -5.275999 4.753655 0.529792
H  7.381302 -2.611591 0.663592
H  5.404616 1.177954 0.457455
H  7.42727 -0.152833 0.977906
H  -4.483795 6.446296 -1.081993
H  -3.52096 5.245132 -1.935866
H  -5.288384 5.141527 -1.946415
elementType: O N C H
totalener: -1015.02212341 hartree
nucrepener: 1639.32769723 hartree
electener: -2654.34982064 hartree
oneelecener: -4636.82158074 hartree
twoeener: 1982.47176010 hartree
cpcmener: -0.03627862 hartree
kineticenergy: 1010.63168266 hartree
xcener: -97.181995057604 hartree
chargesum: 0.0000000
charge: -0.342120 -0.347739 -0.331570 -0.571311 -0.239169 0.046745 -0.059107 0.299592 0.224479 -0.186392 -0.225619 -0.210625 -0.199499 0.288786 0.541325 -0.251959 -0.188979 0.047454 -0.127742 -0.161282 -0.195025 -0.254286 0.112328 0.102050 0.110322 0.098921 0.144180 0.142559 0.161093 0.148363 0.180401 0.146874 0.156148 0.095068 0.096163 0.160777 0.162783 0.160879 0.089002 0.088113 0.088023
qa: -0.3421 -0.3477 -0.3316 -0.5713 -0.2392 0.0467 -0.0591 0.2996 0.2245 -0.1864 -0.2256 -0.2106 -0.1995 0.2888 0.5413 -0.2520 -0.1890 0.0475 -0.1277 -0.1613 -0.1950 -0.2543 0.1123 0.1020 0.1103 0.0989 0.1442 0.1426 0.1611 0.1484 0.1804 0.1469 0.1561 0.0951 0.0962 0.1608 0.1628 0.1609 0.0890 0.0881 0.0880
va: 2.0519 2.0448 2.0692 1.9259 3.1816 3.7698 3.9452 3.7854 3.7255 3.8478 3.9863 3.9910 4.0195 3.6850 4.2743 3.9901 3.8773 3.8387 3.8887 3.9011 3.8966 3.9760 0.9961 0.9969 1.0061 1.0220 1.0100 1.0087 0.9949 1.0032 1.0167 1.0085 0.9989 0.9965 0.9954 0.9880 0.9895 0.9896 1.0065 1.0032 1.0030
dispcorr: -0.015549629 hartree
energy: -1015.037673036606
dipole: -8.57837 8.28679 -0.29159 13.02328 -12.81541 0.20787 0.54945 -0.94789 -0.39843
magnitude: 0.53571 au
magnitude: 1.36166 debye
