program: Orca
programVersion: 5.0.2
elementType: O O O O N C C C C C C C C C C C C C C C C C H H H H H H H H H H H H H H H H H H H
charge: 0
multiplicity: 1
keywords: wb97x-d3
keywords: def2-TZVPP
keywords: def2/J RIJCOSX
keywords: DEFGRID2
keywords: scfconv7
keywords: smallprint printgap noloewdin
keywords: NOSOSCF
formula: C17H19NO4
InChI: InChI=1/C17H19NO4/c1-2-20-17(19)18-12-13-21-14-8-10-16(11-9-14)22-15-6-4-3-5-7-15/h3-11,18H,2,12-13H2,1H3
41 atoms
O  -1.828064 -0.654618 -0.195704
O  3.507918 -1.100106 1.091175
O  -4.928301 2.47757 1.028174
O  -4.432676 2.762517 -1.152507
N  -4.390609 0.705834 -0.183942
C  -2.286628 0.071678 -1.324436
C  -3.798264 0.024921 -1.311804
C  -0.498401 -0.728945 0.040722
C  2.194302 -0.995204 0.691288
C  0.472409 -0.071819 -0.710124
C  -0.106596 -1.523292 1.117401
C  1.815122 -0.199765 -0.376901
C  1.232308 -1.662544 1.435628
C  4.473857 -1.424241 0.176441
C  -4.564404 2.040004 -0.179268
C  4.227172 -2.223525 -0.933731
C  5.754532 -0.950037 0.433703
C  -5.219871 3.875222 1.169278
C  5.275311 -2.537682 -1.788282
C  6.792262 -1.279894 -0.424895
C  6.558942 -2.06962 -1.543011
C  -5.48604 4.141539 2.629136
H  -1.940636 1.109898 -1.289557
H  -1.914489 -0.378013 -2.251092
H  -4.166076 0.462599 -2.238187
H  -4.138854 -1.010227 -1.302622
H  0.20953 0.552688 -1.552663
H  -0.856701 -2.039761 1.702884
H  2.556175 0.330788 -0.961652
H  1.527049 -2.285898 2.270145
H  -4.402901 0.222511 0.70121
H  3.235053 -2.605812 -1.136411
H  5.934738 -0.329841 1.302681
H  -6.091638 4.132553 0.563934
H  -4.37564 4.472303 0.819507
H  5.080754 -3.15984 -2.652116
H  7.787633 -0.907787 -0.220159
H  7.369063 -2.319267 -2.214839
H  -6.32967 3.559476 3.000936
H  -4.612943 3.922545 3.244262
H  -5.72785 5.196163 2.759066
elementType: O N C H
totalener: -1015.02201722 hartree
nucrepener: 1637.47719404 hartree
electener: -2652.49921126 hartree
oneelecener: -4633.14962102 hartree
twoeener: 1980.65040976 hartree
cpcmener: -0.03596835 hartree
kineticenergy: 1010.61881031 hartree
xcener: -97.179319037339 hartree
chargesum: -0.0000000
charge: -0.341830 -0.347784 -0.330927 -0.569988 -0.241657 0.037392 -0.049278 0.296750 0.227135 -0.188015 -0.225153 -0.209489 -0.202097 0.292885 0.540546 -0.191971 -0.254243 0.047510 -0.158385 -0.127577 -0.194176 -0.252931 0.098279 0.117702 0.097490 0.109286 0.144835 0.142212 0.161286 0.148113 0.180626 0.156263 0.147181 0.097965 0.092934 0.162279 0.160652 0.161167 0.088400 0.087686 0.088925
qa: -0.3418 -0.3478 -0.3309 -0.5700 -0.2417 0.0374 -0.0493 0.2967 0.2271 -0.1880 -0.2252 -0.2095 -0.2021 0.2929 0.5405 -0.1920 -0.2542 0.0475 -0.1584 -0.1276 -0.1942 -0.2529 0.0983 0.1177 0.0975 0.1093 0.1448 0.1422 0.1613 0.1481 0.1806 0.1563 0.1472 0.0980 0.0929 0.1623 0.1607 0.1612 0.0884 0.0877 0.0889
va: 2.0490 2.0459 2.0712 1.9274 3.1845 3.7744 3.9398 3.7869 3.7246 3.8543 3.9888 3.9842 4.0203 3.6789 4.2746 3.8822 3.9934 3.8384 3.8991 3.8875 3.8966 3.9745 0.9970 0.9976 1.0222 1.0077 1.0094 1.0089 0.9949 1.0035 1.0164 0.9984 1.0083 0.9948 0.9979 0.9895 0.9881 0.9894 1.0027 1.0033 1.0065
dispcorr: -0.015598526 hartree
energy: -1015.037615745718
dipole: -10.73260 10.40763 -0.32496 7.92848 -8.45639 -0.52792 0.55083 -0.54859 0.00223
magnitude: 0.61992 au
magnitude: 1.57572 debye
