program: Orca
programVersion: 5.0.2
elementType: O O O O N C C C C C C C C C C C C C C C C C H H H H H H H H H H H H H H H H H H H
charge: 0
multiplicity: 1
keywords: wb97x-d3
keywords: def2-TZVPP
keywords: def2/J RIJCOSX
keywords: DEFGRID2
keywords: scfconv7
keywords: smallprint printgap noloewdin
keywords: NOSOSCF
formula: C17H19NO4
InChI: InChI=1/C17H19NO4/c1-2-20-17(19)18-12-13-21-14-8-10-16(11-9-14)22-15-6-4-3-5-7-15/h3-11,18H,2,12-13H2,1H3
41 atoms
O  -3.02114 -1.435357 -0.546986
O  2.41297 -2.027398 0.154698
O  -1.952188 2.736034 0.469834
O  -2.73968 1.631084 -1.335997
N  -3.605016 1.301573 0.743048
C  -3.951597 -1.159015 0.491664
C  -4.521632 0.241624 0.397446
C  -1.691658 -1.522086 -0.303291
C  1.060823 -1.81134 -0.007352
C  -1.039371 -0.945713 0.783977
C  -0.949063 -2.240478 -1.238871
C  0.333244 -1.095863 0.929446
C  0.421662 -2.375506 -1.099844
C  3.252808 -0.946118 0.203179
C  -2.758103 1.859324 -0.139057
C  2.995379 0.232509 -0.486112
C  4.41635 -1.089041 0.948751
C  -0.944295 3.390817 -0.311027
C  3.909552 1.274616 -0.411863
C  5.32476 -0.042577 1.004886
C  5.074961 1.145863 0.330923
C  0.271721 2.519569 -0.52313
H  -4.773954 -1.866259 0.364089
H  -3.521079 -1.342086 1.479206
H  -4.92246 0.417224 -0.600382
H  -5.367489 0.29596 1.082992
H  -1.574786 -0.377607 1.531923
H  -1.450953 -2.692341 -2.085035
H  0.827129 -0.650037 1.783931
H  0.987511 -2.935267 -1.83356
H  -3.43972 1.468484 1.724112
H  2.09905 0.343267 -1.082684
H  4.607201 -2.013392 1.479393
H  -0.681029 4.273156 0.270677
H  -1.359653 3.735685 -1.258881
H  3.705295 2.192857 -0.947466
H  6.229382 -0.157246 1.587698
H  5.782192 1.962671 0.383219
H  0.698984 2.196556 0.426452
H  0.048117 1.637228 -1.12286
H  1.034048 3.094325 -1.050999
elementType: O N C H
totalener: -1015.01792671 hartree
nucrepener: 1801.14527326 hartree
electener: -2816.16319997 hartree
oneelecener: -4961.23210657 hartree
twoeener: 2145.06890659 hartree
cpcmener: -0.04480410 hartree
kineticenergy: 1010.62655010 hartree
xcener: -97.184036691729 hartree
chargesum: 0.0000000
charge: -0.351667 -0.351586 -0.334315 -0.559991 -0.231395 0.045028 -0.027432 0.277555 0.250188 -0.167829 -0.208514 -0.243994 -0.211762 0.265480 0.514135 -0.192680 -0.229667 0.047168 -0.168990 -0.138818 -0.185617 -0.268026 0.111722 0.097098 0.095848 0.108093 0.146345 0.142162 0.159840 0.146901 0.180322 0.174799 0.147073 0.108857 0.092358 0.164004 0.160151 0.160919 0.091690 0.075855 0.108688
qa: -0.3517 -0.3516 -0.3343 -0.5600 -0.2314 0.0450 -0.0274 0.2776 0.2502 -0.1678 -0.2085 -0.2440 -0.2118 0.2655 0.5141 -0.1927 -0.2297 0.0472 -0.1690 -0.1388 -0.1856 -0.2680 0.1117 0.0971 0.0958 0.1081 0.1463 0.1422 0.1598 0.1469 0.1803 0.1748 0.1471 0.1089 0.0924 0.1640 0.1602 0.1609 0.0917 0.0759 0.1087
va: 2.0231 2.0423 2.0673 1.9345 3.1935 3.8268 3.8678 3.7357 3.6847 3.7777 3.9894 3.9641 4.0412 3.6995 4.3085 3.8494 3.9814 3.8940 3.9040 3.9014 3.9038 3.8964 1.0007 1.0005 1.0208 1.0083 1.0172 1.0086 0.9986 1.0037 1.0116 0.9826 1.0078 0.9963 1.0118 0.9903 0.9881 0.9896 0.9976 1.0151 1.0074
dispcorr: -0.021431676 hartree
energy: -1015.039358390061
dipole: -0.99838 0.35556 -0.64282 8.32433 -7.60574 0.71859 2.02910 0.06410 2.09320
magnitude: 2.30458 au
magnitude: 5.85777 debye
