program: Orca
programVersion: 5.0.2
elementType: O O O O N C C C C C C C C C C C C C C C C C H H H H H H H H H H H H H H H H H H H
charge: 0
multiplicity: 1
keywords: wb97x-d3
keywords: def2-TZVPP
keywords: def2/J RIJCOSX
keywords: DEFGRID2
keywords: scfconv7
keywords: smallprint printgap noloewdin
keywords: NOSOSCF
formula: C17H19NO4
InChI: InChI=1/C17H19NO4/c1-2-20-17(19)18-12-13-21-14-8-10-16(11-9-14)22-15-6-4-3-5-7-15/h3-11,18H,2,12-13H2,1H3
41 atoms
O  -2.010592 -0.698818 0.910918
O  2.918627 -2.787393 -0.407381
O  -3.832661 3.52293 0.512652
O  -5.238157 1.930355 -0.243371
N  -2.986996 1.735225 -0.480989
C  -3.110644 -0.692731 0.013925
C  -3.012383 0.401519 -1.033893
C  -0.815982 -1.196394 0.504927
C  1.708055 -2.204433 -0.104287
C  -0.590353 -1.835036 -0.710075
C  0.239557 -1.064014 1.409109
C  0.673841 -2.32843 -1.011664
C  1.491775 -1.568443 1.112415
C  4.062262 -2.035825 -0.383537
C  -4.107392 2.355478 -0.074595
C  4.076466 -0.665284 -0.613735
C  5.247455 -2.725922 -0.157569
C  -4.942643 4.324872 0.94034
C  5.290897 0.008932 -0.608161
C  6.451692 -2.039433 -0.162527
C  6.480863 -0.668345 -0.383242
C  -4.39044 5.597144 1.530478
H  -3.237499 -1.664442 -0.472059
H  -3.988938 -0.53143 0.638938
H  -2.117294 0.281545 -1.642926
H  -3.858156 0.298724 -1.713732
H  -1.37363 -1.962156 -1.444095
H  0.07064 -0.571714 2.358493
H  0.840439 -2.822175 -1.960451
H  2.293014 -1.46994 1.834276
H  -2.095877 2.119303 -0.206983
H  3.160042 -0.120861 -0.801573
H  5.222866 -3.793905 0.018529
H  -5.529921 3.780513 1.681877
H  -5.59061 4.546713 0.090898
H  5.300428 1.076041 -0.787894
H  7.371313 -2.581816 0.014235
H  7.42136 -0.134191 -0.381763
H  -5.217621 6.220425 1.867621
H  -3.752166 5.400721 2.390946
H  -3.822082 6.168575 0.797812
elementType: O N C H
totalener: -1015.02025238 hartree
nucrepener: 1651.73927782 hartree
electener: -2666.75953020 hartree
oneelecener: -4661.35904544 hartree
twoeener: 1994.59951524 hartree
cpcmener: -0.03775555 hartree
kineticenergy: 1010.61932873 hartree
xcener: -97.181150068413 hartree
chargesum: -0.0000000
charge: -0.354455 -0.346655 -0.332619 -0.571689 -0.235151 0.033359 -0.070425 0.308444 0.226144 -0.192559 -0.237841 -0.251874 -0.151642 0.292970 0.542979 -0.192611 -0.254271 0.047212 -0.160136 -0.126692 -0.194913 -0.254152 0.106413 0.118076 0.127643 0.103761 0.144718 0.142329 0.149483 0.159546 0.182352 0.155811 0.146713 0.096492 0.094267 0.162516 0.160616 0.160579 0.089169 0.087953 0.088138
qa: -0.3545 -0.3467 -0.3326 -0.5717 -0.2352 0.0334 -0.0704 0.3084 0.2261 -0.1926 -0.2378 -0.2519 -0.1516 0.2930 0.5430 -0.1926 -0.2543 0.0472 -0.1601 -0.1267 -0.1949 -0.2542 0.1064 0.1181 0.1276 0.1038 0.1447 0.1423 0.1495 0.1595 0.1824 0.1558 0.1467 0.0965 0.0943 0.1625 0.1606 0.1606 0.0892 0.0880 0.0881
va: 2.0373 2.0433 2.0699 1.9257 3.1629 3.8263 3.8630 3.7676 3.7222 3.8248 4.0116 4.0371 3.9580 3.6784 4.2743 3.8806 3.9906 3.8394 3.9013 3.8891 3.8971 3.9762 1.0026 1.0076 1.0000 1.0234 1.0054 1.0111 1.0066 0.9929 1.0132 0.9993 1.0088 0.9957 0.9963 0.9896 0.9880 0.9896 1.0065 1.0032 1.0028
dispcorr: -0.016206146 hartree
energy: -1015.036458524989
dipole: -8.24037 9.00005 0.75968 13.75296 -12.87299 0.87997 1.48816 -1.70145 -0.21329
magnitude: 1.18193 au
magnitude: 3.00422 debye
