program: Orca
programVersion: 5.0.2
elementType: O O O O N C C C C C C C C C C C C C C C C C H H H H H H H H H H H H H H H H H H H
charge: 0
multiplicity: 1
keywords: wb97x-d3
keywords: def2-TZVPP
keywords: def2/J RIJCOSX
keywords: DEFGRID2
keywords: scfconv7
keywords: smallprint printgap noloewdin
keywords: NOSOSCF
formula: C17H19NO4
InChI: InChI=1/C17H19NO4/c1-2-20-17(19)18-12-13-21-14-8-10-16(11-9-14)22-15-6-4-3-5-7-15/h3-11,18H,2,12-13H2,1H3
41 atoms
O  -2.188236 -0.916265 -0.107268
O  3.04753 -2.56772 -0.533778
O  -4.285363 3.049477 -0.814872
O  -4.187843 2.653779 1.405832
N  -4.380838 0.959963 -0.098128
C  -2.746937 -0.458974 1.113159
C  -4.19558 -0.111668 0.852754
C  -0.889213 -1.288624 -0.134605
C  1.758216 -2.102548 -0.386678
C  -0.045646 -1.279818 0.973331
C  -0.394437 -1.711661 -1.367531
C  1.274247 -1.692756 0.844106
C  0.92481 -2.108251 -1.495239
C  4.09746 -1.76068 -0.187753
C  -4.264859 2.252224 0.257352
C  5.293218 -2.401287 0.115686
C  4.017042 -0.373104 -0.169766
C  -4.172685 4.464278 -0.608938
C  6.410541 -1.647806 0.440959
C  5.143719 0.366551 0.165243
C  6.342073 -0.260937 0.474466
C  -2.74209 4.903661 -0.404161
H  -2.699171 -1.238174 1.881365
H  -2.201684 0.415179 1.484442
H  -4.725635 -0.988352 0.481163
H  -4.662587 0.151401 1.800549
H  -0.39357 -0.964916 1.947482
H  -1.04725 -1.721864 -2.231147
H  1.916837 -1.690814 1.715694
H  1.301225 -2.429769 -2.457894
H  -4.304029 0.731198 -1.077925
H  5.345477 -3.482538 0.096386
H  3.095062 0.137376 -0.415741
H  -4.809765 4.780818 0.218003
H  -4.576463 4.903159 -1.519887
H  7.338056 -2.15238 0.678137
H  5.077454 1.446661 0.178909
H  7.214053 0.323496 0.735099
H  -2.109526 4.594211 -1.236378
H  -2.709063 5.992295 -0.350951
H  -2.316005 4.514104 0.519479
elementType: O N C H
totalener: -1015.02148370 hartree
nucrepener: 1658.62445041 hartree
electener: -2673.64593412 hartree
oneelecener: -4675.46633060 hartree
twoeener: 2001.82039649 hartree
cpcmener: -0.03552929 hartree
kineticenergy: 1010.62147208 hartree
xcener: -97.180607230950 hartree
chargesum: -0.0000000
charge: -0.341312 -0.347230 -0.337918 -0.570243 -0.240073 0.041119 -0.057992 0.301844 0.218821 -0.185939 -0.229124 -0.211661 -0.191349 0.294622 0.541203 -0.253095 -0.192701 0.047622 -0.127562 -0.164074 -0.195288 -0.252042 0.115290 0.102092 0.110270 0.099711 0.143958 0.142616 0.161258 0.148190 0.179723 0.146924 0.156391 0.087993 0.106666 0.160540 0.162569 0.160903 0.087062 0.095415 0.084798
qa: -0.3413 -0.3472 -0.3379 -0.5702 -0.2401 0.0411 -0.0580 0.3018 0.2188 -0.1859 -0.2291 -0.2117 -0.1913 0.2946 0.5412 -0.2531 -0.1927 0.0476 -0.1276 -0.1641 -0.1953 -0.2520 0.1153 0.1021 0.1103 0.0997 0.1440 0.1426 0.1613 0.1482 0.1797 0.1469 0.1564 0.0880 0.1067 0.1605 0.1626 0.1609 0.0871 0.0954 0.0848
va: 2.0511 2.0462 2.0707 1.9246 3.1865 3.7637 3.9484 3.7831 3.7293 3.8468 3.9853 3.9943 4.0157 3.6820 4.2787 3.9886 3.8735 3.8565 3.8900 3.9042 3.8966 3.9110 0.9962 0.9978 1.0066 1.0205 1.0100 1.0089 0.9948 1.0029 1.0174 1.0085 0.9992 1.0117 0.9958 0.9880 0.9896 0.9895 1.0047 1.0078 1.0152
dispcorr: -0.016030337 hartree
energy: -1015.037514039540
dipole: -5.16120 4.90368 -0.25752 12.54836 -12.36326 0.18510 1.93301 -2.32151 -0.38850
magnitude: 0.50151 au
magnitude: 1.27474 debye
