program: Orca
programVersion: 5.0.2
elementType: O O O O N C C C C C C C C C C C C C C C C C H H H H H H H H H H H H H H H H H H H
charge: 0
multiplicity: 1
keywords: wb97x-d3
keywords: def2-TZVPP
keywords: def2/J RIJCOSX
keywords: DEFGRID2
keywords: scfconv7
keywords: smallprint printgap noloewdin
keywords: NOSOSCF
formula: C17H19NO4
InChI: InChI=1/C17H19NO4/c1-2-20-17(19)18-12-13-21-14-8-10-16(11-9-14)22-15-6-4-3-5-7-15/h3-11,18H,2,12-13H2,1H3
41 atoms
O  -2.111352 -0.848889 0.272572
O  3.105862 -2.595626 0.495279
O  -4.408652 3.140844 0.831292
O  -4.313835 2.607103 -1.360383
N  -4.335473 1.009251 0.254574
C  -2.733746 -0.462691 -0.941675
C  -4.173304 -0.117699 -0.633323
C  -0.81756 -1.239762 0.249081
C  1.823931 -2.098593 0.397145
C  -0.261735 -1.608047 1.473682
C  -0.035354 -1.30183 -0.901518
C  1.054204 -2.027647 1.548645
C  1.281747 -1.736405 -0.824061
C  4.160633 -1.830282 0.07776
C  -4.34031 2.277301 -0.186768
C  5.320687 -2.515101 -0.265848
C  4.121493 -0.441746 0.028927
C  -4.429674 4.542407 0.529805
C  6.445301 -1.805284 -0.657091
C  5.254703 0.253889 -0.372295
C  6.418692 -0.418002 -0.717733
C  -3.054461 5.095943 0.239473
H  -2.217187 0.394735 -1.385823
H  -2.714966 -1.281976 -1.668414
H  -4.688076 0.077323 -1.572912
H  -4.668509 -0.977072 -0.181888
H  -0.86503 -1.560483 2.37129
H  -0.430402 -1.027579 -1.869892
H  1.477351 -2.309526 2.504233
H  1.87461 -1.79176 -1.728496
H  -4.273177 0.845162 1.246933
H  5.340084 -3.596764 -0.224365
H  3.227441 0.103118 0.30275
H  -4.838778 5.004396 1.42661
H  -5.122145 4.744561 -0.28839
H  7.344862 -2.344537 -0.923677
H  5.221635 1.334884 -0.408804
H  7.296212 0.132352 -1.029087
H  -3.126932 6.178031 0.125042
H  -2.365829 4.896189 1.060872
H  -2.627204 4.693602 -0.678115
elementType: O N C H
totalener: -1015.02145838 hartree
nucrepener: 1650.64154709 hartree
electener: -2665.66300547 hartree
oneelecener: -4659.55531118 hartree
twoeener: 1993.89230571 hartree
cpcmener: -0.03588009 hartree
kineticenergy: 1010.62477538 hartree
xcener: -97.181667016530 hartree
chargesum: 0.0000000
charge: -0.340395 -0.347290 -0.339116 -0.574061 -0.235126 0.047991 -0.064943 0.302549 0.216935 -0.229219 -0.187892 -0.191927 -0.208664 0.290759 0.544320 -0.251834 -0.189837 0.046120 -0.127758 -0.165331 -0.194877 -0.252088 0.101002 0.113355 0.100007 0.110519 0.142412 0.144427 0.148518 0.161311 0.180960 0.146740 0.156294 0.106469 0.088477 0.160567 0.162665 0.161093 0.095528 0.086756 0.084583
qa: -0.3404 -0.3473 -0.3391 -0.5741 -0.2351 0.0480 -0.0649 0.3025 0.2169 -0.2292 -0.1879 -0.1919 -0.2087 0.2908 0.5443 -0.2518 -0.1898 0.0461 -0.1278 -0.1653 -0.1949 -0.2521 0.1010 0.1134 0.1000 0.1105 0.1424 0.1444 0.1485 0.1613 0.1810 0.1467 0.1563 0.1065 0.0885 0.1606 0.1627 0.1611 0.0955 0.0868 0.0846
va: 2.0540 2.0446 2.0692 1.9197 3.1862 3.7614 3.9495 3.7834 3.7310 3.9862 3.8436 4.0155 3.9960 3.6843 4.2729 3.9876 3.8732 3.8592 3.8906 3.9055 3.8955 3.9092 0.9977 0.9957 1.0210 1.0062 1.0091 1.0099 1.0027 0.9951 1.0164 1.0087 0.9994 0.9959 1.0110 0.9880 0.9896 0.9895 1.0077 1.0047 1.0156
dispcorr: -0.015908142 hartree
energy: -1015.037366522315
dipole: -6.03397 5.69971 -0.33426 12.75737 -12.54839 0.20898 -2.31861 2.74340 0.42479
magnitude: 0.57952 au
magnitude: 1.47303 debye
