program: Orca
programVersion: 5.0.2
elementType: O O O O N C C C C C C C C C C C C C C C C C H H H H H H H H H H H H H H H H H H H
charge: 0
multiplicity: 1
keywords: wb97x-d3
keywords: def2-TZVPP
keywords: def2/J RIJCOSX
keywords: DEFGRID2
keywords: scfconv7
keywords: smallprint printgap noloewdin
keywords: NOSOSCF
formula: C17H19NO4
InChI: InChI=1/C17H19NO4/c1-2-20-17(19)18-12-13-21-14-8-10-16(11-9-14)22-15-6-4-3-5-7-15/h3-11,18H,2,12-13H2,1H3
41 atoms
O  -1.968619 -0.752815 0.579035
O  3.100962 -2.4573 -0.736919
O  -4.180156 3.300871 0.773133
O  -4.902057 2.142813 -1.02518
N  -4.214679 1.090692 0.867091
C  -3.00041 -0.668146 -0.390775
C  -4.266338 -0.245721 0.320823
C  -0.738896 -1.157692 0.189074
C  1.847783 -1.986123 -0.410873
C  0.202787 -1.331248 1.205274
C  -0.373414 -1.407962 -1.128832
C  1.485691 -1.749037 0.910791
C  0.924743 -1.812221 -1.423644
C  4.204862 -1.779238 -0.291964
C  -4.456511 2.174744 0.108987
C  5.357686 -2.528666 -0.092816
C  4.210645 -0.405495 -0.080315
C  -4.45744 4.551502 0.127227
C  6.520415 -1.898434 0.324415
C  5.380441 0.209191 0.344841
C  6.537461 -0.528799 0.552321
C  -3.377408 4.957772 -0.847196
H  -2.74278 0.053993 -1.172749
H  -3.162138 -1.640397 -0.868416
H  -5.097712 -0.322918 -0.377968
H  -4.481032 -0.937518 1.135011
H  -0.080711 -1.146615 2.233806
H  -1.073659 -1.288166 -1.943913
H  2.197893 -1.892679 1.713626
H  1.20537 -1.998403 -2.452488
H  -3.742725 1.219951 1.74861
H  5.342387 -3.597527 -0.263551
H  3.320331 0.18787 -0.243727
H  -4.516896 5.269158 0.943915
H  -5.435787 4.520711 -0.353596
H  7.414973 -2.486906 0.480521
H  5.381569 1.278318 0.511451
H  7.443477 -0.041637 0.886454
H  -2.402592 5.006715 -0.362599
H  -3.308858 4.282658 -1.698684
H  -3.605575 5.95261 -1.231097
elementType: O N C H
totalener: -1015.02129785 hartree
nucrepener: 1649.27275893 hartree
electener: -2664.29405677 hartree
oneelecener: -4656.79463371 hartree
twoeener: 1992.50057693 hartree
cpcmener: -0.03544495 hartree
kineticenergy: 1010.62661523 hartree
xcener: -97.181488363608 hartree
chargesum: -0.0000000
charge: -0.340594 -0.348606 -0.338497 -0.571142 -0.239501 0.040541 -0.052389 0.304096 0.234816 -0.242552 -0.179274 -0.152721 -0.264921 0.283509 0.541285 -0.247699 -0.187067 0.047857 -0.130253 -0.161929 -0.192070 -0.252902 0.098634 0.114715 0.099195 0.109193 0.142741 0.144183 0.160422 0.149353 0.180105 0.147259 0.157236 0.107620 0.088048 0.160552 0.162594 0.161278 0.087198 0.084436 0.095251
qa: -0.3406 -0.3486 -0.3385 -0.5711 -0.2395 0.0405 -0.0524 0.3041 0.2348 -0.2426 -0.1793 -0.1527 -0.2649 0.2835 0.5413 -0.2477 -0.1871 0.0479 -0.1303 -0.1619 -0.1921 -0.2529 0.0986 0.1147 0.0992 0.1092 0.1427 0.1442 0.1604 0.1494 0.1801 0.1473 0.1572 0.1076 0.0880 0.1606 0.1626 0.1613 0.0872 0.0844 0.0953
va: 2.0524 2.0426 2.0697 1.9225 3.1902 3.7743 3.9424 3.7831 3.7174 3.9999 3.8402 3.9463 4.0585 3.6837 4.2765 3.9890 3.8762 3.8556 3.8905 3.9022 3.8947 3.9100 0.9961 0.9974 1.0214 1.0081 1.0104 1.0087 0.9924 1.0070 1.0169 1.0081 0.9978 0.9957 1.0113 0.9882 0.9896 0.9893 1.0046 1.0163 1.0076
dispcorr: -0.015938141 hartree
energy: -1015.037235986757
dipole: -6.94647 6.99697 0.05050 11.91592 -11.49518 0.42074 -1.07285 2.02717 0.95432
magnitude: 1.04417 au
magnitude: 2.65408 debye
