program: Orca
programVersion: 5.0.2
elementType: O O O O N C C C C C C C C C C C C C C C C C H H H H H H H H H H H H H H H H H H H
charge: 0
multiplicity: 1
keywords: wb97x-d3
keywords: def2-TZVPP
keywords: def2/J RIJCOSX
keywords: DEFGRID2
keywords: scfconv7
keywords: smallprint printgap noloewdin
keywords: NOSOSCF
formula: C17H19NO4
InChI: InChI=1/C17H19NO4/c1-2-20-17(19)18-12-13-21-14-8-10-16(11-9-14)22-15-6-4-3-5-7-15/h3-11,18H,2,12-13H2,1H3
41 atoms
O  -2.002563 -0.702776 0.115421
O  3.0927 -2.783624 0.185993
O  -4.06202 3.144989 1.33563
O  -4.034945 3.015075 -0.919898
N  -4.179768 1.155661 0.376546
C  -2.581915 -0.114338 -1.037285
C  -4.021578 0.211473 -0.704707
C  -0.732241 -1.160118 0.059018
C  1.8485 -2.193659 0.132919
C  0.069131 -1.123068 -1.079054
C  -0.224702 -1.709389 1.235668
C  1.35479 -1.647916 -1.039721
C  1.061305 -2.216693 1.275066
C  4.202344 -2.059214 -0.15588
C  -4.08208 2.482212 0.175324
C  4.26297 -0.673267 -0.069774
C  5.313049 -2.789507 -0.563395
C  -4.1007 4.578377 1.29487
C  5.444751 -0.024913 -0.404157
C  6.487445 -2.127425 -0.886155
C  6.559881 -0.742161 -0.813802
C  -5.504661 5.103222 1.098105
H  -2.034105 0.78899 -1.326519
H  -2.563932 -0.807408 -1.88479
H  -4.504611 0.596901 -1.600882
H  -4.551603 -0.701987 -0.435919
H  -0.28759 -0.701818 -2.008833
H  -0.843848 -1.735952 2.123509
H  1.962602 -1.627402 -1.935746
H  1.446953 -2.641652 2.192979
H  -4.070456 0.808789 1.317427
H  3.407844 -0.095925 0.256849
H  5.254767 -3.869043 -0.623975
H  -3.422467 4.956941 0.529188
H  -3.709946 4.889533 2.262179
H  5.488493 1.054289 -0.337146
H  7.348146 -2.701575 -1.203549
H  7.475323 -0.227844 -1.073621
H  -5.918409 4.820656 0.130514
H  -6.174466 4.744879 1.880133
H  -5.48962 6.192277 1.14676
elementType: O N C H
totalener: -1015.02141931 hartree
nucrepener: 1642.45254444 hartree
electener: -2657.47396375 hartree
oneelecener: -4643.17154740 hartree
twoeener: 1985.69758365 hartree
cpcmener: -0.03542960 hartree
kineticenergy: 1010.61988603 hartree
xcener: -97.180140949818 hartree
chargesum: 0.0000000
charge: -0.341623 -0.346692 -0.337874 -0.570458 -0.241250 0.040842 -0.056368 0.298401 0.222106 -0.186155 -0.226920 -0.211103 -0.194674 0.295161 0.539297 -0.193242 -0.254417 0.048971 -0.163089 -0.126553 -0.196199 -0.252882 0.105126 0.113832 0.098717 0.110663 0.144126 0.142599 0.161644 0.147869 0.180472 0.156253 0.146548 0.086881 0.107207 0.162411 0.160743 0.161204 0.085797 0.087193 0.095437
qa: -0.3416 -0.3467 -0.3379 -0.5705 -0.2413 0.0408 -0.0564 0.2984 0.2221 -0.1862 -0.2269 -0.2111 -0.1947 0.2952 0.5393 -0.1932 -0.2544 0.0490 -0.1631 -0.1266 -0.1962 -0.2529 0.1051 0.1138 0.0987 0.1107 0.1441 0.1426 0.1616 0.1479 0.1805 0.1563 0.1465 0.0869 0.1072 0.1624 0.1607 0.1612 0.0858 0.0872 0.0954
va: 2.0510 2.0461 2.0722 1.9235 3.1800 3.7657 3.9460 3.7883 3.7260 3.8531 3.9834 3.9961 4.0183 3.6811 4.2809 3.8754 3.9894 3.8532 3.9035 3.8888 3.8969 3.9139 0.9976 0.9956 1.0220 1.0062 1.0098 1.0088 0.9948 1.0032 1.0171 0.9993 1.0088 1.0131 0.9957 0.9897 0.9880 0.9894 1.0146 1.0048 1.0078
dispcorr: -0.015877825 hartree
energy: -1015.037297135281
dipole: -10.77154 10.39172 -0.37982 13.04158 -12.90931 0.13227 -0.44364 0.82406 0.38042
magnitude: 0.55361 au
magnitude: 1.40715 debye
