program: Orca
programVersion: 5.0.2
elementType: O O O O N C C C C C C C C C C C C C C C C C H H H H H H H H H H H H H H H H H H H
charge: 0
multiplicity: 1
keywords: wb97x-d3
keywords: def2-TZVPP
keywords: def2/J RIJCOSX
keywords: DEFGRID2
keywords: scfconv7
keywords: smallprint printgap noloewdin
keywords: NOSOSCF
formula: C17H19NO4
InChI: InChI=1/C17H19NO4/c1-2-20-17(19)18-12-13-21-14-8-10-16(11-9-14)22-15-6-4-3-5-7-15/h3-11,18H,2,12-13H2,1H3
41 atoms
O  -3.272791 -1.749054 0.045853
O  2.14218 -1.452544 1.054023
O  -1.07754 1.862041 -0.241816
O  -2.973433 1.545153 0.940879
N  -2.797493 0.895123 -1.233826
C  -3.845285 -1.35547 -1.193795
C  -4.032133 0.147272 -1.294395
C  -1.923567 -1.669645 0.217035
C  0.800925 -1.503722 0.745959
C  -1.472011 -1.333197 1.489122
C  -0.996262 -1.95095 -0.78354
C  -0.113802 -1.243485 1.752053
C  0.36107 -1.87107 -0.516873
C  2.977455 -0.640736 0.336566
C  -2.332078 1.429457 -0.088618
C  4.337425 -0.907363 0.454419
C  2.534946 0.419212 -0.445392
C  -0.420581 2.496759 0.865767
C  5.253349 -0.111288 -0.214548
C  3.466266 1.203329 -1.114114
C  4.824903 0.946062 -1.00708
C  0.536277 3.531156 0.329873
H  -3.272422 -1.729694 -2.045452
H  -4.825986 -1.830535 -1.238679
H  -4.527733 0.354918 -2.244117
H  -4.699308 0.500309 -0.510644
H  -2.186876 -1.126341 2.274778
H  -1.308226 -2.24067 -1.777551
H  0.228057 -0.966428 2.741009
H  1.070215 -2.098063 -1.302944
H  -2.129106 0.733588 -1.974143
H  4.672415 -1.733611 1.068462
H  1.481465 0.643308 -0.545165
H  0.108501 1.730619 1.436719
H  -1.149123 2.964175 1.526937
H  6.309665 -0.325266 -0.118216
H  3.115794 2.027712 -1.72159
H  5.541607 1.562167 -1.5327
H  1.062164 3.992807 1.165906
H  1.285169 3.101093 -0.334974
H  0.008637 4.318981 -0.207516
elementType: O N C H
totalener: -1015.01711991 hartree
nucrepener: 1842.85238925 hartree
electener: -2857.86950916 hartree
oneelecener: -5044.11119805 hartree
twoeener: 2186.24168889 hartree
cpcmener: -0.04151274 hartree
kineticenergy: 1010.63266497 hartree
xcener: -97.187661467150 hartree
chargesum: 0.0000000
charge: -0.363833 -0.345162 -0.324510 -0.554014 -0.221110 0.020347 -0.014603 0.200751 0.296234 -0.130792 -0.143141 -0.307557 -0.195108 0.333334 0.493397 -0.259296 -0.224339 0.026425 -0.127156 -0.168418 -0.196113 -0.244832 0.102197 0.110955 0.103671 0.095050 0.139847 0.152150 0.147328 0.157793 0.176316 0.146053 0.155746 0.107873 0.108162 0.160241 0.163392 0.160376 0.094289 0.073940 0.094117
qa: -0.3638 -0.3452 -0.3245 -0.5540 -0.2211 0.0203 -0.0146 0.2008 0.2962 -0.1308 -0.1431 -0.3076 -0.1951 0.3333 0.4934 -0.2593 -0.2243 0.0264 -0.1272 -0.1684 -0.1961 -0.2448 0.1022 0.1110 0.1037 0.0950 0.1398 0.1522 0.1473 0.1578 0.1763 0.1461 0.1557 0.1079 0.1082 0.1602 0.1634 0.1604 0.0943 0.0739 0.0941
va: 2.0212 2.0612 2.0471 1.9400 3.1891 3.8698 3.8487 3.7837 3.6108 3.8614 3.8083 4.0122 3.9351 3.6582 4.3466 3.9882 3.8786 3.7959 3.8904 3.9117 3.9065 3.9680 0.9965 1.0054 1.0101 1.0271 1.0141 0.9998 1.0051 0.9959 1.0143 1.0094 0.9945 0.9860 1.0184 0.9879 0.9889 0.9898 1.0067 1.0039 1.0067
dispcorr: -0.022543062 hartree
energy: -1015.039662974690
dipole: 0.74534 -0.41059 0.33475 9.46657 -9.25023 0.21634 -5.01966 2.67240 -2.34726
magnitude: 2.38085 au
magnitude: 6.05165 debye
