program: Gaussian 09
title: 000053807
version: EM64L-G09RevD.01
frameworkgroup: C1[X(C15H13ClO3)]
method: RPBEPBE
basis: SDD
operation: Freq
keyword: #p
keyword: freq=noraman
keyword: PBEPBE/SDD
title: #p freq=noraman PBEPBE/SDD
converged: YES YES NO NO
title: Mulliken charges:
elementType: Cl O O O C C C C C C C C C C C C C C C H H H H H H H H H H H H H
charge: -0.060259 -0.311082 -0.410070 -0.238674 0.264926 0.326252 -0.003929 0.305705 -0.627338 -0.397093 -0.372856 -0.248286 -0.401046 -0.354111 -0.220845 -0.219353 0.209550 -0.113237 -0.537269 0.272870 0.248985 0.248818 0.254327 0.229755 0.250177 0.284170 0.254548 0.255758 0.272801 0.230006 0.229943 0.376856
chargesum: 0.00000
title: Mulliken charges with hydrogens summed into heavy atoms:
elementType: Cl O O O C C C C C C C C C C C C C C C
charge: -0.060259 -0.311082 -0.033214 -0.238674 0.264926 0.326252 -0.003929 0.305705 -0.105483 -0.148275 -0.118528 -0.018531 -0.150869 -0.069941 0.033703 0.036404 0.209550 -0.113237 0.195481
polarizability: 2.86236397e+02 -2.31484416e+01 1.62001845e+02 1.08199102e+01 1.52800871e+01 1.13029856e+02
1716.lowfreq: -4.7166 -0.0015 0.0001 0.0012 3.0712 5.3540 22.1698 31.0579 53.0803
frequency: 22.0702 31.0397 53.0731 57.9437 63.3192 96.0203 128.3194 135.5434 155.0701 180.6953 203.3252 235.0434 250.1691 267.1877 302.8191 350.4257 384.5893 405.6233 409.9989 442.0023 452.4276 492.3420 529.6494 537.2737 558.6530 571.6250 593.2986 627.1315 648.8007 688.4149 712.0797 729.2925 766.8887 784.1542 794.0408 827.5681 834.4651 860.3603 878.8014 916.4618 934.8448 942.7529 951.9042 966.3110 978.4628 998.5637 1043.5574 1068.5864 1080.1133 1091.1293 1111.7194 1124.5702 1150.5180 1173.7950 1182.0710 1191.0110 1195.2318 1257.3221 1274.2569 1294.9896 1300.5426 1319.6923 1344.5895 1364.3367 1396.1422 1424.2069 1446.7116 1450.5286 1457.0044 1464.7043 1481.2383 1488.1150 1572.0553 1588.1336 1597.6889 1598.0387 1658.3032 2973.2617 3037.0882 3075.1295 3108.2740 3120.6009 3127.8982 3136.9629 3140.5287 3159.4599 3162.0159 3170.3043 3181.2559 3504.0196
redmass: 8.1189 8.4328 5.9263 4.3863 6.6230 5.5841 3.2542 4.6667 4.7857 1.0944 5.2141 5.4433 7.2298 5.8949 5.3345 5.2240 4.8715 2.5550 2.8683 6.0858 4.2398 3.5129 4.4494 4.4866 3.5948 3.2859 5.0445 6.7754 1.6318 4.4734 3.9307 4.8119 2.6497 2.9810 2.2803 1.2696 1.6903 4.4518 4.8269 1.4845 1.9090 8.6416 1.3552 1.3718 1.3482 4.4566 2.3424 3.4288 2.2517 2.3254 1.3806 1.2337 1.3658 1.7109 1.2926 1.2035 1.5446 1.8673 1.4482 1.7490 1.7217 2.0575 4.3311 8.6460 3.7645 1.6673 1.2799 2.0326 1.4213 1.1098 1.0675 2.7086 6.9140 6.5957 6.7473 6.4792 8.2867 1.0298 1.0581 1.1054 1.1040 1.1028 1.0863 1.0908 1.0898 1.0893 1.0992 1.0958 1.0968 1.0638
irintensity: 1.2768 0.0372 0.4418 0.6916 0.1443 0.2677 9.8206 2.3531 0.9385 0.2887 2.0730 0.7538 1.3894 7.1442 2.9759 5.2391 6.4350 21.7532 0.4501 15.3456 4.8245 2.4174 17.2674 49.9383 5.8953 31.9294 6.8391 1.8846 100.2727 39.4952 4.3783 21.6717 13.1209 30.5604 58.9140 3.1194 38.2623 11.8748 0.1488 4.6292 8.0346 43.3536 0.2304 2.0696 0.8672 60.1273 191.6806 65.2605 34.7428 109.0944 6.4481 0.5633 0.7467 21.9836 13.8274 8.7585 21.7924 11.3729 0.1045 1.3163 0.2648 87.6199 11.7279 1.2000 10.0315 22.8981 33.4282 50.3267 20.1455 11.9767 9.8311 53.0550 0.8705 1.1060 5.9155 7.1769 208.2765 45.9443 14.8824 14.4887 2.8531 18.7701 1.1222 17.0101 3.0368 1.9754 21.1097 5.4857 1.2450 25.9686
temp: 298.150 k
press: 1.00000 atm
elementType: 17 8 8 8 6 6 6 6 6 6 6 6 6 6 6 6 6 6 6 1 1 1 1 1 1 1 1 1 1 1 1 1
symmnumber: 1
zpe: 633055.1 jmol-1
zpe.correction: 0.241118 hartree
zpe.thermalcorrener: 0.258718 hartree
zpe.thermalcorrenthalpy: 0.259662 hartree
zpe.thermalcorrgfe: 0.193401 hartree
zpe.sumelectzpe: -1263.772736 hartree
zpe.sumelectthermal: -1263.755136 hartree
zpe.sumelectthermalent: -1263.754191 hartree
zpe.sumelectthermalfe: -1263.820453 hartree
dipole: -2.7900 1.2903 0.5626
dipole: 3.1249
quadrupole: -117.1770 -111.1375 -116.4357
quadrupole: -1.2214 -0.0138 5.8957
quadrupole: -2.2602 3.7792 -1.5190 -1.2214 -0.0138 5.8957
hfenergy: -1264.0138536 hartree
pointgroup: C01 [X(C15H13Cl1O3)]
dipole: 1.1060548 -0.4030691 0.3545643 debye
polarizability: 285.3617764|-27.9515132|145.578014|-7.1682604|-26.9194493|130.3283076 unknown
InChI: InChI=1S/C15H13ClO3/c1-19-15-11(9-14(17)18)3-2-4-13(15)10-5-7-12(16)8-6-10/h2-8,17H,9H2,1H3
charge 0 multiplicity 1
32 atoms
Cl -6.124509 0.781533 0.104995
O  0.562321 1.086587 -1.181617
O  5.381174 0.466394 0.012881
O  3.765776 2.081219 0.419438
C  -0.18941 -0.81601 0.208025
C  2.194799 -0.556485 -0.440722
C  0.852033 -0.09279 -0.450411
C  -1.618994 -0.384692 0.178697
C  3.284576 0.231637 -1.164226
C  0.16841 -2.00779 0.894812
C  2.508411 -1.753612 0.246425
C  1.498976 -2.473258 0.919211
C  -2.434389 -0.537117 1.334239
C  -2.218221 0.138236 -1.001502
C  -3.80144 -0.185784 1.322772
C  -3.584117 0.491035 -1.030663
C  4.116488 1.041586 -0.18207
C  -4.357704 0.322916 0.134163
C  0.421796 2.312603 -0.353978
H  2.806362 0.934781 -1.866359
H  3.951334 -0.449071 -1.716544
H  -0.618949 -2.595358 1.379751
H  3.543712 -2.114026 0.249772
H  1.743019 -3.402396 1.444767
H  -1.993064 -0.912379 2.264218
H  -1.608409 0.270135 -1.898818
H  -4.415906 -0.298622 2.220486
H  -4.037564 0.884555 -1.945073
H  1.380956 2.539809 0.145719
H  -0.386525 2.188376 0.39052
H  0.157127 3.11249 -1.062298
H  5.889631 1.005995 0.678591
