program: Orca
programVersion: 5.0.2
elementType: O O O O N C C C C C C C C C C C C C C C C C H H H H H H H H H H H H H H H H H H H
charge: 0
multiplicity: 1
keywords: wb97x-d3
keywords: def2-TZVPP
keywords: def2/J RIJCOSX
keywords: DEFGRID2
keywords: scfconv7
keywords: smallprint printgap noloewdin
keywords: NOSOSCF
formula: C17H19NO4
InChI: InChI=1/C17H19NO4/c1-2-20-17(19)18-12-13-21-14-8-10-16(11-9-14)22-15-6-4-3-5-7-15/h3-11,18H,2,12-13H2,1H3
41 atoms
O  -2.726179 -2.021106 0.508983
O  2.440902 -0.994469 -1.1281
O  -1.809699 2.439005 -0.023339
O  -3.779397 1.874558 -0.974436
N  -3.095364 0.941099 0.978389
C  -3.867921 -1.277141 0.110275
C  -4.117646 -0.081116 1.012273
C  -1.482433 -1.69584 0.07302
C  1.163811 -1.218149 -0.670156
C  -0.428638 -2.304865 0.754276
C  -1.194554 -0.855981 -0.99792
C  0.884504 -2.081037 0.382196
C  0.125299 -0.608761 -1.352285
C  3.478959 -0.822393 -0.251694
C  -2.958076 1.759839 -0.080562
C  4.72768 -1.251787 -0.683794
C  3.334999 -0.202647 0.984609
C  -1.556158 3.421696 -1.037569
C  5.837355 -1.05874 0.125134
C  4.453446 -0.028193 1.78856
C  5.706451 -0.4521 1.367521
C  -2.247382 4.733478 -0.74592
H  -3.822509 -0.986458 -0.940877
H  -4.71305 -1.958728 0.211506
H  -5.081979 0.35094 0.745494
H  -4.204532 -0.417816 2.043933
H  -0.643064 -2.972041 1.579637
H  -1.970888 -0.38085 -1.580958
H  1.679571 -2.581979 0.919588
H  0.337767 0.054907 -2.180887
H  -2.294066 0.814233 1.578058
H  4.827625 -1.727675 -1.651471
H  2.368255 0.145213 1.325371
H  -1.832584 3.034787 -2.019348
H  -0.475315 3.550467 -1.02743
H  6.808045 -1.391202 -0.218926
H  4.338722 0.451066 2.752214
H  6.572057 -0.309398 2.000499
H  -1.950529 5.466685 -1.496198
H  -3.332954 4.645128 -0.780624
H  -1.961512 5.124251 0.23097
elementType: O N C H
totalener: -1015.01756527 hartree
nucrepener: 1751.76720409 hartree
electener: -2766.78476936 hartree
oneelecener: -4861.71071359 hartree
twoeener: 2094.92594423 hartree
cpcmener: -0.03501572 hartree
kineticenergy: 1010.61415127 hartree
xcener: -97.181855007368 hartree
chargesum: -0.0000000
charge: -0.353889 -0.345362 -0.331735 -0.556011 -0.237303 0.021458 -0.027179 0.254377 0.287266 -0.214372 -0.150498 -0.192215 -0.281200 0.314195 0.504726 -0.264154 -0.212184 0.047601 -0.121476 -0.149508 -0.196479 -0.252822 0.102123 0.115233 0.099011 0.105984 0.140667 0.144593 0.157171 0.147479 0.188313 0.146643 0.157926 0.089454 0.108724 0.159986 0.162593 0.160915 0.095857 0.086392 0.087698
qa: -0.3539 -0.3454 -0.3317 -0.5560 -0.2373 0.0215 -0.0272 0.2544 0.2873 -0.2144 -0.1505 -0.1922 -0.2812 0.3142 0.5047 -0.2642 -0.2122 0.0476 -0.1215 -0.1495 -0.1965 -0.2528 0.1021 0.1152 0.0990 0.1060 0.1407 0.1446 0.1572 0.1475 0.1883 0.1466 0.1579 0.0895 0.1087 0.1600 0.1626 0.1609 0.0959 0.0864 0.0877
va: 2.0401 2.0525 2.0679 1.9384 3.1823 3.8265 3.8809 3.7802 3.6716 4.0028 3.7801 3.9610 4.0465 3.6616 4.3244 4.0017 3.9025 3.8398 3.8792 3.8893 3.9024 3.9286 1.0039 1.0044 1.0191 1.0073 1.0108 1.0128 0.9940 1.0100 1.0066 1.0089 0.9981 1.0115 0.9954 0.9883 0.9892 0.9897 1.0073 1.0136 1.0047
dispcorr: -0.018978321 hartree
energy: -1015.036543593515
dipole: -5.10696 5.42226 0.31529 10.46209 -10.23271 0.22937 1.45811 -0.25464 1.20347
magnitude: 1.26505 au
magnitude: 3.21551 debye
