program: Orca
programVersion: 5.0.2
elementType: O O O O N C C C C C C C C C C C C C C C C C H H H H H H H H H H H H H H H H H H H
charge: 0
multiplicity: 1
keywords: wb97x-d3
keywords: def2-TZVPP
keywords: def2/J RIJCOSX
keywords: DEFGRID2
keywords: scfconv7
keywords: smallprint printgap noloewdin
keywords: NOSOSCF
formula: C17H19NO4
InChI: InChI=1/C17H19NO4/c1-2-20-17(19)18-12-13-21-14-8-10-16(11-9-14)22-15-6-4-3-5-7-15/h3-11,18H,2,12-13H2,1H3
41 atoms
O  -2.839506 -2.180788 0.428096
O  2.092899 -0.392798 -1.277005
O  -1.749654 1.912708 -0.669384
O  -2.789779 1.781388 1.331405
N  -3.492703 0.567358 -0.455253
C  -3.704522 -1.328206 1.167637
C  -4.388607 -0.293111 0.286954
C  -1.606408 -1.71235 0.075702
C  0.900887 -0.857521 -0.774756
C  -0.784036 -0.987533 0.933381
C  -1.152247 -2.023766 -1.200874
C  0.458312 -0.546247 0.502821
C  0.102359 -1.611959 -1.620285
C  3.215041 -0.384407 -0.490299
C  -2.679042 1.442336 0.16643
C  3.497533 -1.392747 0.424203
C  4.105004 0.663686 -0.685355
C  -0.795573 2.854211 -0.159678
C  4.678267 -1.334946 1.151608
C  5.286616 0.701253 0.040576
C  5.576229 -0.291827 0.966825
C  -1.335615 4.265087 -0.129244
H  -4.471817 -1.973804 1.59574
H  -3.186432 -0.856314 2.004274
H  -5.021726 -0.794073 -0.443628
H  -5.051079 0.303634 0.915789
H  -1.095111 -0.746676 1.940949
H  -1.784219 -2.593358 -1.870532
H  1.071305 0.040232 1.175459
H  0.449406 -1.859708 -2.61541
H  -3.202795 0.243959 -1.366279
H  2.811665 -2.21713 0.572409
H  3.873653 1.439185 -1.404722
H  0.047666 2.783551 -0.845255
H  -0.442898 2.542334 0.824699
H  4.8967 -2.117851 1.866172
H  5.979028 1.518011 -0.116058
H  6.494685 -0.255563 1.537073
H  -2.158444 4.377594 0.575745
H  -0.539908 4.943365 0.180189
H  -1.677096 4.581569 -1.114911
elementType: O N C H
totalener: -1015.01677349 hartree
nucrepener: 1804.15070619 hartree
electener: -2819.16747968 hartree
oneelecener: -4966.86710618 hartree
twoeener: 2147.69962650 hartree
cpcmener: -0.03506304 hartree
kineticenergy: 1010.62167958 hartree
xcener: -97.183561735302 hartree
chargesum: 0.0000000
charge: -0.372697 -0.350161 -0.329669 -0.551183 -0.216236 0.027451 -0.037549 0.179698 0.291408 -0.093834 -0.173272 -0.265809 -0.225642 0.297872 0.486847 -0.196234 -0.259624 0.052558 -0.151870 -0.124685 -0.191475 -0.255593 0.114012 0.097425 0.107622 0.098104 0.154996 0.141311 0.159432 0.148237 0.181475 0.156171 0.147453 0.109222 0.089563 0.162434 0.161172 0.160977 0.085388 0.096667 0.088038
qa: -0.3727 -0.3502 -0.3297 -0.5512 -0.2162 0.0275 -0.0375 0.1797 0.2914 -0.0938 -0.1733 -0.2658 -0.2256 0.2979 0.4868 -0.1962 -0.2596 0.0526 -0.1519 -0.1247 -0.1915 -0.2556 0.1140 0.0974 0.1076 0.0981 0.1550 0.1413 0.1594 0.1482 0.1815 0.1562 0.1475 0.1092 0.0896 0.1624 0.1612 0.1610 0.0854 0.0967 0.0880
va: 2.0073 2.0367 2.0580 1.9432 3.1802 3.8251 3.8815 3.8414 3.6425 3.7106 3.9697 3.8932 4.0366 3.6720 4.3565 3.8994 4.0008 3.8183 3.8910 3.8797 3.8988 3.9497 1.0060 1.0074 1.0054 1.0163 1.0021 1.0084 0.9955 1.0040 1.0113 0.9985 1.0084 0.9943 1.0080 0.9892 0.9881 0.9896 1.0148 1.0060 1.0040
dispcorr: -0.020988840 hartree
energy: -1015.037762332653
dipole: -2.92426 2.88393 -0.04033 8.72761 -8.84673 -0.11912 3.07991 -3.43011 -0.35021
magnitude: 0.37210 au
magnitude: 0.94581 debye
