program: Orca
programVersion: 5.0.2
elementType: O O O O N C C C C C C C C C C C C C C C C C H H H H H H H H H H H H H H H H H H H
charge: 0
multiplicity: 1
keywords: wb97x-d3
keywords: def2-TZVPP
keywords: def2/J RIJCOSX
keywords: DEFGRID2
keywords: scfconv7
keywords: smallprint printgap noloewdin
keywords: NOSOSCF
formula: C17H19NO4
InChI: InChI=1/C17H19NO4/c1-2-20-17(19)18-12-13-21-14-8-10-16(11-9-14)22-15-6-4-3-5-7-15/h3-11,18H,2,12-13H2,1H3
41 atoms
O  -2.673891 -2.021471 -0.511968
O  2.400543 -0.845019 1.281101
O  -2.09303 2.630438 -0.507766
O  -3.960763 1.970891 0.575616
N  -3.181802 0.852712 -1.237345
C  -3.853607 -1.307585 -0.180944
C  -4.155129 -0.210856 -1.187407
C  -1.459754 -1.652558 -0.045181
C  1.147923 -1.106779 0.787891
C  -0.377308 -2.356711 -0.575681
C  -1.219171 -0.677443 0.917747
C  0.915043 -2.095993 -0.160062
C  0.082258 -0.404063 1.320781
C  3.463512 -0.706577 0.437153
C  -3.142029 1.828375 -0.313234
C  3.352363 -0.181672 -0.845856
C  4.705528 -1.074133 0.941213
C  -1.905518 3.72648 0.395565
C  4.494835 -0.040397 -1.621763
C  5.838474 -0.916974 0.157719
C  5.740026 -0.406451 -1.129861
C  -1.2286 3.308469 1.680358
H  -4.663368 -2.038295 -0.221416
H  -3.829717 -0.921585 0.840316
H  -4.216705 -0.644252 -2.185675
H  -5.142597 0.196344 -0.963304
H  -0.555901 -3.12632 -1.316485
H  -2.019846 -0.115629 1.377827
H  1.733013 -2.669328 -0.578468
H  0.258356 0.359748 2.068019
H  -2.418214 0.774003 -1.890482
H  2.391691 0.11995 -1.243682
H  4.780248 -1.475443 1.944368
H  -2.85551 4.22606 0.592363
H  -1.274899 4.425485 -0.152802
H  4.40496 0.363869 -2.621975
H  6.802851 -1.203607 0.557305
H  6.624462 -0.294242 -1.742962
H  -1.848519 2.640784 2.27786
H  -0.272965 2.820571 1.485582
H  -1.028434 4.196983 2.281159
elementType: O N C H
totalener: -1015.02482664 hartree
nucrepener: 1758.72005811 hartree
electener: -2773.74488475 hartree
oneelecener: -4875.49513534 hartree
twoeener: 2101.75025060 hartree
cpcmener: -0.02910604 hartree
kineticenergy: 1010.63550665 hartree
xcener: -97.185225341587 hartree
chargesum: -0.0000000
charge: -0.338461 -0.334444 -0.327129 -0.526519 -0.234827 0.024308 -0.038471 0.259580 0.252475 -0.215244 -0.149087 -0.178392 -0.265989 0.297687 0.491756 -0.198406 -0.255503 0.052322 -0.153244 -0.121817 -0.190085 -0.273907 0.112597 0.099234 0.104570 0.098404 0.137512 0.136819 0.154773 0.150697 0.182992 0.154581 0.143990 0.088889 0.106059 0.158430 0.156661 0.156968 0.091439 0.085719 0.103063
qa: -0.3385 -0.3344 -0.3271 -0.5265 -0.2348 0.0243 -0.0385 0.2596 0.2525 -0.2152 -0.1491 -0.1784 -0.2660 0.2977 0.4918 -0.1984 -0.2555 0.0523 -0.1532 -0.1218 -0.1901 -0.2739 0.1126 0.0992 0.1046 0.0984 0.1375 0.1368 0.1548 0.1507 0.1830 0.1546 0.1440 0.0889 0.1061 0.1584 0.1567 0.1570 0.0914 0.0857 0.1031
va: 2.0593 2.0631 2.0684 1.9776 3.1731 3.8257 3.8954 3.8094 3.7399 3.9959 3.7976 3.9652 4.0381 3.6900 4.3377 3.8945 3.9997 3.8481 3.9011 3.8893 3.9051 3.9106 1.0039 1.0037 1.0061 1.0195 1.0116 1.0114 0.9946 1.0054 1.0110 0.9990 1.0096 1.0119 0.9957 0.9907 0.9893 0.9909 1.0093 1.0028 1.0115
dispcorr: -0.019507948 hartree
energy: -1015.044334588080
dipole: -3.04689 3.27061 0.22372 7.42790 -7.29709 0.13081 0.27284 -1.43166 -1.15882
magnitude: 1.18745 au
magnitude: 3.01825 debye
