program: Orca
programVersion: 5.0.2
elementType: O O O O N C C C C C C C C C C C C C C C C C H H H H H H H H H H H H H H H H H H H
charge: 0
multiplicity: 1
keywords: wb97x-d3
keywords: def2-TZVPP
keywords: def2/J RIJCOSX
keywords: DEFGRID2
keywords: scfconv7
keywords: smallprint printgap noloewdin
keywords: NOSOSCF
formula: C17H19NO4
InChI: InChI=1/C17H19NO4/c1-2-20-17(19)18-12-13-21-14-8-10-16(11-9-14)22-15-6-4-3-5-7-15/h3-11,18H,2,12-13H2,1H3
41 atoms
O  -2.902404 -2.187304 0.416842
O  1.995679 -0.300868 -1.252867
O  -1.710103 1.830318 -0.647965
O  -2.596268 1.700895 1.425571
N  -3.495582 0.571608 -0.325353
C  -3.715925 -1.361468 1.239398
C  -4.396547 -0.253232 0.445994
C  -1.666941 -1.727716 0.074906
C  0.830973 -0.820752 -0.756131
C  -1.270191 -1.872424 -1.249952
C  -0.786166 -1.156844 0.988593
C  -0.023106 -1.432949 -1.661902
C  0.45169 -0.689915 0.572365
C  3.151102 -0.332368 -0.526768
C  -2.596483 1.392705 0.249566
C  3.503725 -1.402579 0.287512
C  4.010199 0.748243 -0.682148
C  -0.671887 2.709686 -0.202969
C  4.721255 -1.374277 0.95344
C  5.228989 0.756026 -0.020618
C  5.58828 -0.300226 0.80537
C  -1.11565 4.153878 -0.175088
H  -4.484752 -2.010755 1.660595
H  -3.153434 -0.950984 2.080099
H  -5.10475 -0.687678 -0.258563
H  -4.978544 0.356751 1.140053
H  -1.945614 -2.324864 -1.965631
H  -1.051106 -1.053348 2.032434
H  0.274875 -1.540961 -2.697428
H  1.105887 -0.220637 1.296189
H  -3.342999 0.314745 -1.288119
H  2.844945 -2.253696 0.405229
H  3.724448 1.572811 -1.323562
H  0.132755 2.57165 -0.924907
H  -0.295598 2.39467 0.771382
H  4.993019 -2.20632 1.590246
H  5.89657 1.598411 -0.148726
H  6.53628 -0.288182 1.326772
H  -1.480471 4.47828 -1.150284
H  -1.896693 4.330755 0.564109
H  -0.263877 4.783492 0.086266
elementType: O N C H
totalener: -1015.02272554 hartree
nucrepener: 1815.03104653 hartree
electener: -2830.05377207 hartree
oneelecener: -4988.61643181 hartree
twoeener: 2158.56265974 hartree
cpcmener: -0.02942613 hartree
kineticenergy: 1010.64666931 hartree
xcener: -97.187798578874 hartree
chargesum: -0.0000000
charge: -0.363079 -0.337899 -0.323938 -0.521218 -0.215243 0.031727 -0.051025 0.204759 0.283410 -0.182447 -0.130998 -0.226700 -0.233720 0.306923 0.474316 -0.208474 -0.262738 0.050404 -0.145571 -0.118415 -0.189207 -0.257134 0.111269 0.096048 0.105944 0.097308 0.140000 0.150342 0.144292 0.156533 0.177014 0.154740 0.144641 0.106068 0.089939 0.158947 0.157555 0.156944 0.086895 0.087509 0.094281
qa: -0.3631 -0.3379 -0.3239 -0.5212 -0.2152 0.0317 -0.0510 0.2048 0.2834 -0.1824 -0.1310 -0.2267 -0.2337 0.3069 0.4743 -0.2085 -0.2627 0.0504 -0.1456 -0.1184 -0.1892 -0.2571 0.1113 0.0960 0.1059 0.0973 0.1400 0.1503 0.1443 0.1565 0.1770 0.1547 0.1446 0.1061 0.0899 0.1589 0.1576 0.1569 0.0869 0.0875 0.0943
va: 2.0212 2.0430 2.0633 1.9825 3.1717 3.8191 3.8955 3.8286 3.6348 3.9772 3.7670 4.0343 3.8739 3.6795 4.3737 3.9132 4.0045 3.8230 3.8941 3.8830 3.9082 3.9565 1.0060 1.0081 1.0041 1.0154 1.0088 1.0000 1.0061 0.9975 1.0143 0.9991 1.0093 0.9944 1.0095 0.9903 0.9894 0.9910 1.0040 1.0126 1.0064
dispcorr: -0.021409338 hartree
energy: -1015.044134876040
dipole: -2.44148 2.28887 -0.15261 8.45189 -8.53659 -0.08470 2.88711 -3.25829 -0.37117
magnitude: 0.41016 au
magnitude: 1.04255 debye
