program: Orca
programVersion: 5.0.2
elementType: O O O O N C C C C C C C C C C C C C C C C C H H H H H H H H H H H H H H H H H H H
charge: 0
multiplicity: 1
keywords: wb97x-d3
keywords: def2-TZVPP
keywords: def2/J RIJCOSX
keywords: DEFGRID2
keywords: scfconv7
keywords: smallprint printgap noloewdin
keywords: NOSOSCF
formula: C17H19NO4
InChI: InChI=1/C17H19NO4/c1-2-20-17(19)18-12-13-21-14-8-10-16(11-9-14)22-15-6-4-3-5-7-15/h3-11,18H,2,12-13H2,1H3
41 atoms
O  -2.931084 -2.096143 0.222734
O  2.117259 -0.404066 -1.190122
O  -1.956073 2.214749 -0.775172
O  -2.90003 1.914162 1.255453
N  -3.522862 0.67949 -0.543213
C  -3.780935 -1.263231 0.998273
C  -4.443197 -0.186965 0.152943
C  -1.673292 -1.659952 -0.056905
C  0.902033 -0.862827 -0.756443
C  -0.839637 -1.067669 0.887156
C  -1.195691 -1.870508 -1.345944
C  0.438079 -0.659918 0.535674
C  0.089284 -1.485659 -1.691987
C  3.212992 -0.441022 -0.376154
C  -2.795045 1.622882 0.079278
C  4.10002 0.623186 -0.475779
C  3.483044 -1.508452 0.472557
C  -1.177801 3.323365 -0.310041
C  5.266224 0.615842 0.275028
C  4.647811 -1.495495 1.227173
C  5.543715 -0.4389 1.133777
C  0.098464 2.898173 0.378133
H  -4.556677 -1.912025 1.407631
H  -3.255073 -0.822964 1.847697
H  -5.074622 -0.652572 -0.603095
H  -5.103643 0.396828 0.797932
H  -1.167609 -0.908545 1.905857
H  -1.835519 -2.33767 -2.084446
H  1.059397 -0.180548 1.281427
H  0.450842 -1.647884 -2.699841
H  -3.318028 0.478868 -1.509011
H  3.878098 1.446214 -1.143904
H  2.800271 -2.345536 0.547836
H  -1.778268 3.965931 0.33624
H  -0.947295 3.890461 -1.211597
H  5.956959 1.444946 0.189914
H  4.856543 -2.325659 1.889707
H  6.451134 -0.439139 1.723132
H  0.680329 3.788354 0.6224
H  -0.092177 2.363078 1.307786
H  0.712518 2.270592 -0.268693
elementType: O N C H
totalener: -1015.02331129 hartree
nucrepener: 1807.24241471 hartree
electener: -2822.26572600 hartree
oneelecener: -4973.08037461 hartree
twoeener: 2150.81464861 hartree
cpcmener: -0.02963809 hartree
kineticenergy: 1010.64493542 hartree
xcener: -97.187113151769 hartree
chargesum: 0.0000000
charge: -0.361784 -0.337796 -0.325004 -0.529788 -0.215660 0.034723 -0.049976 0.192867 0.303886 -0.128864 -0.173032 -0.251806 -0.242063 0.302028 0.492469 -0.257307 -0.201097 0.045580 -0.118694 -0.145290 -0.188169 -0.249729 0.110062 0.093654 0.105740 0.096566 0.149890 0.139303 0.158566 0.144136 0.176472 0.143897 0.154181 0.089831 0.105156 0.157330 0.158629 0.156926 0.106069 0.083784 0.074316
qa: -0.3618 -0.3378 -0.3250 -0.5298 -0.2157 0.0347 -0.0500 0.1929 0.3039 -0.1289 -0.1730 -0.2518 -0.2421 0.3020 0.4925 -0.2573 -0.2011 0.0456 -0.1187 -0.1453 -0.1882 -0.2497 0.1101 0.0937 0.1057 0.0966 0.1499 0.1393 0.1586 0.1441 0.1765 0.1439 0.1542 0.0898 0.1052 0.1573 0.1586 0.1569 0.1061 0.0838 0.0743
va: 2.0201 2.0399 2.0673 1.9750 3.1803 3.8245 3.8961 3.8588 3.6207 3.7792 3.9721 3.9032 4.0538 3.6770 4.3420 3.9989 3.9120 3.8636 3.8824 3.8929 3.9075 3.9049 1.0062 1.0087 1.0048 1.0170 0.9998 1.0086 0.9945 1.0061 1.0149 1.0094 0.9993 1.0125 0.9957 0.9893 0.9903 0.9909 1.0099 1.0137 1.0053
dispcorr: -0.021401630 hartree
energy: -1015.044712919392
dipole: -0.50516 0.33605 -0.16911 6.35143 -6.33944 0.01199 3.91006 -4.31159 -0.40154
magnitude: 0.43586 au
magnitude: 1.10786 debye
