program: Orca
programVersion: 5.0.2
elementType: O O O O N C C C C C C C C C C C C C C C C C H H H H H H H H H H H H H H H H H H H
charge: 0
multiplicity: 1
keywords: wb97x-d3
keywords: def2-TZVPP
keywords: def2/J RIJCOSX
keywords: DEFGRID2
keywords: scfconv7
keywords: smallprint printgap noloewdin
keywords: NOSOSCF
formula: C17H19NO4
InChI: InChI=1/C17H19NO4/c1-2-20-17(19)18-12-13-21-14-8-10-16(11-9-14)22-15-6-4-3-5-7-15/h3-11,18H,2,12-13H2,1H3
41 atoms
O  -2.726777 -2.189394 -0.582034
O  2.075076 0.203138 0.672811
O  -1.68033 1.972404 -0.173708
O  -3.331116 1.319387 1.221692
N  -3.278495 0.660745 -0.949762
C  -3.908901 -1.589132 -0.066597
C  -4.310715 -0.345571 -0.847366
C  -1.533308 -1.630869 -0.235512
C  0.926602 -0.469433 0.344944
C  -1.186214 -1.348332 1.080849
C  -0.622361 -1.362255 -1.252608
C  0.042395 -0.769943 1.367428
C  0.601876 -0.780606 -0.969212
C  3.277511 -0.189966 0.160824
C  -2.803216 1.317628 0.126053
C  3.585668 -1.518618 -0.10828
C  4.225363 0.807002 -0.035384
C  -1.054106 2.748703 0.854199
C  4.849576 -1.837766 -0.585145
C  5.486517 0.470861 -0.503592
C  5.80412 -0.850492 -0.787808
C  -1.672199 4.120805 0.990335
H  -4.699945 -2.333468 -0.16737
H  -3.813967 -1.368432 0.998398
H  -4.579937 -0.62173 -1.866143
H  -5.209479 0.070017 -0.386601
H  -1.858544 -1.575219 1.897959
H  -0.884612 -1.587084 -2.279133
H  0.303032 -0.540894 2.393161
H  1.283646 -0.552746 -1.779294
H  -2.702909 0.644145 -1.777102
H  2.85781 -2.303639 0.054192
H  3.97443 1.838017 0.181959
H  -0.013395 2.82883 0.541722
H  -1.070888 2.210581 1.803241
H  5.086984 -2.872953 -0.794618
H  6.220886 1.251765 -0.654778
H  6.786639 -1.10861 -1.160407
H  -1.112067 4.694005 1.730353
H  -1.633982 4.669599 0.048739
H  -2.708816 4.074788 1.323908
elementType: O N C H
totalener: -1015.02292620 hartree
nucrepener: 1808.50690617 hartree
electener: -2823.52983236 hartree
oneelecener: -4975.61940718 hartree
twoeener: 2152.08957481 hartree
cpcmener: -0.02960142 hartree
kineticenergy: 1010.64644646 hartree
xcener: -97.186886388595 hartree
chargesum: -0.0000000
charge: -0.366045 -0.340861 -0.323598 -0.520761 -0.220428 0.032621 -0.048787 0.226576 0.270980 -0.124925 -0.206189 -0.267684 -0.166514 0.291478 0.478416 -0.198662 -0.261349 0.049558 -0.150289 -0.119264 -0.189502 -0.258438 0.109862 0.095306 0.105077 0.096870 0.147886 0.142310 0.145410 0.157249 0.178450 0.153017 0.144022 0.105689 0.091301 0.158002 0.156718 0.156804 0.094535 0.087254 0.087909
qa: -0.3660 -0.3409 -0.3236 -0.5208 -0.2204 0.0326 -0.0488 0.2266 0.2710 -0.1249 -0.2062 -0.2677 -0.1665 0.2915 0.4784 -0.1987 -0.2613 0.0496 -0.1503 -0.1193 -0.1895 -0.2584 0.1099 0.0953 0.1051 0.0969 0.1479 0.1423 0.1454 0.1572 0.1785 0.1530 0.1440 0.1057 0.0913 0.1580 0.1567 0.1568 0.0945 0.0873 0.0879
va: 2.0148 2.0277 2.0647 1.9824 3.1676 3.8229 3.8890 3.7964 3.6065 3.7727 3.9936 3.9647 3.9456 3.6998 4.3668 3.9001 4.0018 3.8197 3.8995 3.8887 3.9051 3.9555 1.0064 1.0091 1.0044 1.0148 0.9976 1.0090 1.0082 0.9942 1.0132 1.0003 1.0093 0.9952 1.0107 0.9908 0.9897 0.9909 1.0066 1.0038 1.0132
dispcorr: -0.021370794 hartree
energy: -1015.044296992494
dipole: -3.66135 3.83071 0.16935 7.04981 -7.10248 -0.05267 0.14771 -1.25666 -1.10895
magnitude: 1.12305 au
magnitude: 2.85456 debye
