program: Orca
programVersion: 5.0.2
elementType: O O O O N C C C C C C C C C C C C C C C C C H H H H H H H H H H H H H H H H H H H
charge: 0
multiplicity: 1
keywords: wb97x-d3
keywords: def2-TZVPP
keywords: def2/J RIJCOSX
keywords: DEFGRID2
keywords: scfconv7
keywords: smallprint printgap noloewdin
keywords: NOSOSCF
formula: C17H19NO4
InChI: InChI=1/C17H19NO4/c1-2-20-17(19)18-12-13-21-14-8-10-16(11-9-14)22-15-6-4-3-5-7-15/h3-11,18H,2,12-13H2,1H3
41 atoms
O  -2.421778 -1.951787 -0.814066
O  2.492319 0.314723 0.224063
O  -2.813585 2.069005 1.495146
O  -4.142715 1.97278 -0.327136
N  -3.689903 0.127121 0.909976
C  -3.593127 -1.236823 -1.172334
C  -4.38123 -0.803858 0.051502
C  -1.245893 -1.322404 -0.58489
C  1.290052 -0.275583 -0.072511
C  -0.928281 -0.026577 -0.979584
C  -0.278019 -2.083447 0.072007
C  0.339564 0.484682 -0.730597
C  0.977783 -1.567233 0.33335
C  3.664096 -0.349919 0.009309
C  -3.586967 1.433925 0.611076
C  3.838873 -1.271232 -1.017184
C  4.722298 -0.023832 0.849564
C  -2.614281 3.477001 1.326406
C  5.080146 -1.869978 -1.186401
C  5.958414 -0.622448 0.660812
C  6.143839 -1.552586 -0.353435
C  -1.552151 3.795052 0.298666
H  -3.378702 -0.391473 -1.828693
H  -4.204707 -1.933642 -1.747978
H  -5.327741 -0.375372 -0.282303
H  -4.629328 -1.679408 0.651273
H  -1.639519 0.607087 -1.491339
H  -0.519616 -3.090967 0.387496
H  0.578477 1.492284 -1.047299
H  1.703532 -2.17568 0.858755
H  -3.138623 -0.238319 1.670258
H  3.024753 -1.523799 -1.684726
H  4.57401 0.697691 1.643557
H  -2.303126 3.826696 2.310231
H  -3.558095 3.96994 1.086635
H  5.213485 -2.588445 -1.985098
H  6.778563 -0.363032 1.31804
H  7.107987 -2.023127 -0.494216
H  -1.381998 4.872714 0.28672
H  -0.604868 3.314058 0.544626
H  -1.845044 3.497516 -0.707711
elementType: O N C H
totalener: -1015.02479274 hartree
nucrepener: 1748.42685874 hartree
electener: -2763.45165147 hartree
oneelecener: -4855.09573161 hartree
twoeener: 2091.64408013 hartree
cpcmener: -0.02894446 hartree
kineticenergy: 1010.63545792 hartree
xcener: -97.184873937571 hartree
chargesum: 0.0000000
charge: -0.342598 -0.334727 -0.327580 -0.527492 -0.234810 0.025656 -0.035109 0.239870 0.268782 -0.135260 -0.207218 -0.283157 -0.177866 0.297980 0.494967 -0.201445 -0.256816 0.050451 -0.150949 -0.120070 -0.192665 -0.273370 0.099265 0.111436 0.097183 0.103917 0.140556 0.137015 0.149191 0.156026 0.182055 0.155049 0.143184 0.105606 0.089195 0.158303 0.157072 0.157382 0.103581 0.086618 0.090793
qa: -0.3426 -0.3347 -0.3276 -0.5275 -0.2348 0.0257 -0.0351 0.2399 0.2688 -0.1353 -0.2072 -0.2832 -0.1779 0.2980 0.4950 -0.2014 -0.2568 0.0505 -0.1509 -0.1201 -0.1927 -0.2734 0.0993 0.1114 0.0972 0.1039 0.1406 0.1370 0.1492 0.1560 0.1821 0.1550 0.1432 0.1056 0.0892 0.1583 0.1571 0.1574 0.1036 0.0866 0.0908
va: 2.0527 2.0626 2.0680 1.9782 3.1715 3.8296 3.8964 3.8146 3.7128 3.7638 3.9977 4.0338 3.9690 3.6899 4.3360 3.8972 4.0002 3.8509 3.8998 3.8890 3.9062 3.9096 1.0033 1.0047 1.0200 1.0062 1.0103 1.0121 1.0060 0.9937 1.0116 0.9987 1.0102 0.9959 1.0112 0.9907 0.9892 0.9907 1.0110 1.0021 1.0106
dispcorr: -0.019459080 hartree
energy: -1015.044251817135
dipole: -3.49743 3.52390 0.02647 5.54456 -6.17185 -0.62729 -0.39806 0.96649 0.56843
magnitude: 0.84694 au
magnitude: 2.15275 debye
