program: Orca
programVersion: 5.0.2
elementType: O O O O N C C C C C C C C C C C C C C C C C H H H H H H H H H H H H H H H H H H H
charge: 0
multiplicity: 1
keywords: wb97x-d3
keywords: def2-TZVPP
keywords: def2/J RIJCOSX
keywords: DEFGRID2
keywords: scfconv7
keywords: smallprint printgap noloewdin
keywords: NOSOSCF
formula: C17H19NO4
InChI: InChI=1/C17H19NO4/c1-2-20-17(19)18-12-13-21-14-8-10-16(11-9-14)22-15-6-4-3-5-7-15/h3-11,18H,2,12-13H2,1H3
41 atoms
O  -1.824682 -1.002291 -0.040131
O  3.36623 -2.601637 0.828768
O  -4.912445 3.729093 -0.287862
O  -4.444273 2.346878 1.429602
N  -4.181179 1.69421 -0.730598
C  -2.193721 0.352705 -0.213365
C  -3.695199 0.367631 -0.4500
C  -0.526086 -1.310901 0.159534
C  2.099948 -2.144612 0.565903
C  -0.219958 -2.668371 0.247257
C  0.496644 -0.374475 0.280198
C  1.085088 -3.082848 0.440402
C  1.80452 -0.793654 0.49139
C  4.42819 -2.124141 0.117378
C  -4.502239 2.572413 0.236287
C  4.335003 -1.748133 -1.217878
C  5.648606 -2.072888 0.779366
C  -5.358141 4.745493 0.617642
C  5.473674 -1.310359 -1.879758
C  6.778973 -1.641983 0.101469
C  6.697966 -1.25239 -1.228408
C  -5.804185 5.926517 -0.207077
H  -1.94494 0.944429 0.674312
H  -1.673274 0.791629 -1.072256
H  -3.938784 -0.264238 -1.304592
H  -4.217624 -0.044036 0.414431
H  -1.011174 -3.401743 0.154132
H  0.301054 0.687778 0.223772
H  1.313478 -4.139506 0.500869
H  2.584918 -0.050482 0.598607
H  -4.22864 1.99365 -1.691591
H  3.39124 -1.79672 -1.745904
H  5.709664 -2.371682 1.818368
H  -4.546115 5.02928 1.291003
H  -6.183334 4.367954 1.225892
H  5.39815 -1.018601 -2.919399
H  7.726752 -1.603214 0.622799
H  7.580014 -0.90866 -1.752277
H  -6.155085 6.715254 0.45928
H  -4.987912 6.334553 -0.804541
H  -6.626888 5.665893 -0.873542
elementType: O N C H
totalener: -1015.02794704 hartree
nucrepener: 1612.26977786 hartree
electener: -2627.29772490 hartree
oneelecener: -4582.59013444 hartree
twoeener: 1955.29240954 hartree
cpcmener: -0.03138946 hartree
kineticenergy: 1010.63921388 hartree
xcener: -97.182038158496 hartree
chargesum: 0.0000000
charge: -0.327908 -0.335678 -0.328440 -0.535658 -0.247834 0.039291 -0.033953 0.294791 0.222072 -0.224328 -0.186750 -0.196981 -0.208367 0.281904 0.519519 -0.187574 -0.247093 0.048139 -0.154268 -0.123773 -0.190270 -0.252108 0.098975 0.096319 0.104379 0.095259 0.139002 0.140336 0.145316 0.157376 0.178890 0.154221 0.144096 0.093628 0.093292 0.158380 0.156451 0.157433 0.087682 0.087485 0.086746
qa: -0.3279 -0.3357 -0.3284 -0.5357 -0.2478 0.0393 -0.0340 0.2948 0.2221 -0.2243 -0.1867 -0.1970 -0.2084 0.2819 0.5195 -0.1876 -0.2471 0.0481 -0.1543 -0.1238 -0.1903 -0.2521 0.0990 0.0963 0.1044 0.0953 0.1390 0.1403 0.1453 0.1574 0.1789 0.1542 0.1441 0.0936 0.0933 0.1584 0.1565 0.1574 0.0877 0.0875 0.0867
va: 2.0727 2.0611 2.0703 1.9701 3.1762 3.7833 3.8835 3.8007 3.7475 3.9964 3.8502 4.0169 3.9882 3.7023 4.3027 3.8879 3.9959 3.8443 3.9027 3.8923 3.9031 3.9748 1.0017 0.9958 1.0084 1.0189 1.0098 1.0108 1.0045 0.9966 1.0148 0.9987 1.0091 0.9965 0.9966 0.9908 0.9894 0.9907 1.0071 1.0029 1.0033
dispcorr: -0.015284086 hartree
energy: -1015.043231129554
dipole: -11.14754 10.83149 -0.31605 15.83829 -14.55105 1.28724 -4.04653 2.23311 -1.81343
magnitude: 2.24619 au
magnitude: 5.70937 debye
