program: Orca
programVersion: 5.0.2
elementType: O O O O N C C C C C C C C C C C C C C C C C H H H H H H H H H H H H H H H H H H H
charge: 0
multiplicity: 1
keywords: wb97x-d3
keywords: def2-TZVPP
keywords: def2/J RIJCOSX
keywords: DEFGRID2
keywords: scfconv7
keywords: smallprint printgap noloewdin
keywords: NOSOSCF
formula: C17H19NO4
InChI: InChI=1/C17H19NO4/c1-2-20-17(19)18-12-13-21-14-8-10-16(11-9-14)22-15-6-4-3-5-7-15/h3-11,18H,2,12-13H2,1H3
41 atoms
O  -2.095509 -0.426809 -0.162991
O  2.92369 -2.670829 -0.397221
O  -3.55295 3.332505 0.90321
O  -3.824953 2.224846 -1.043643
N  -4.164048 1.214576 0.967308
C  -3.130096 -0.998096 0.612949
C  -4.359592 -0.125553 0.47464
C  -0.880565 -1.013834 -0.167464
C  1.691729 -2.074187 -0.305669
C  -0.5598 -2.167864 0.538877
C  0.099521 -0.398647 -0.94874
C  0.728856 -2.68676 0.473386
C  1.373813 -0.926869 -1.025894
C  4.058417 -1.929965 -0.24036
C  -3.8401 2.250381 0.171107
C  4.125372 -0.809467 0.580119
C  5.189108 -2.377627 -0.913562
C  -3.325211 4.568091 0.217536
C  5.331842 -0.135329 0.710009
C  6.388629 -1.698624 -0.766031
C  6.466668 -0.570903 0.040218
C  -4.616225 5.261851 -0.15079
H  -3.368013 -2.010855 0.268045
H  -2.834227 -1.064363 1.666477
H  -4.683497 -0.084201 -0.564618
H  -5.166995 -0.596733 1.03753
H  -1.289529 -2.681214 1.149908
H  -0.148735 0.49517 -1.507919
H  0.972881 -3.5835 1.029244
H  2.113496 -0.442879 -1.651805
H  -4.086983 1.34038 1.965323
H  3.253971 -0.460276 1.119457
H  5.125798 -3.254243 -1.546334
H  -2.694936 4.410891 -0.658808
H  -2.758282 5.172828 0.924425
H  5.380339 0.738084 1.347661
H  7.265576 -2.05192 -1.293245
H  7.40253 -0.038625 0.147001
H  -5.238893 5.433969 0.727579
H  -4.388762 6.233588 -0.591251
H  -5.194701 4.696226 -0.88086
elementType: O N C H
totalener: -1015.02794649 hartree
nucrepener: 1664.02937081 hartree
electener: -2679.05731730 hartree
oneelecener: -4686.81764859 hartree
twoeener: 2007.76033129 hartree
cpcmener: -0.03479500 hartree
kineticenergy: 1010.64274085 hartree
xcener: -97.183950344399 hartree
chargesum: 0.0000000
charge: -0.319699 -0.334386 -0.334827 -0.537844 -0.230810 0.026727 -0.042212 0.299194 0.240070 -0.178041 -0.235589 -0.268380 -0.157656 0.290549 0.511021 -0.194382 -0.251915 0.048037 -0.153914 -0.122394 -0.190751 -0.252142 0.104861 0.098498 0.099636 0.106141 0.140761 0.141584 0.145191 0.157232 0.169649 0.154710 0.144077 0.086035 0.103317 0.158480 0.156967 0.156806 0.085098 0.093495 0.086805
qa: -0.3197 -0.3344 -0.3348 -0.5378 -0.2308 0.0267 -0.0422 0.2992 0.2401 -0.1780 -0.2356 -0.2684 -0.1577 0.2905 0.5110 -0.1944 -0.2519 0.0480 -0.1539 -0.1224 -0.1908 -0.2521 0.1049 0.0985 0.0996 0.1061 0.1408 0.1416 0.1452 0.1572 0.1696 0.1547 0.1441 0.0860 0.1033 0.1585 0.1570 0.1568 0.0851 0.0935 0.0868
va: 2.0812 2.0624 2.0681 1.9623 3.1701 3.8331 3.9141 3.8036 3.7272 3.8542 3.9845 4.0716 3.9403 3.6942 4.3277 3.8911 3.9966 3.8635 3.9041 3.8911 3.9048 3.9120 0.9963 0.9921 1.0260 1.0044 1.0075 1.0111 1.0085 0.9939 1.0186 0.9984 1.0093 1.0133 0.9955 0.9906 0.9891 0.9909 1.0051 1.0084 1.0142
dispcorr: -0.016027895 hartree
energy: -1015.043974388946
dipole: -10.02938 9.39088 -0.63849 11.61801 -11.53975 0.07826 2.71578 -0.88140 1.83438
magnitude: 1.94391 au
magnitude: 4.94101 debye
