program: Orca
programVersion: 5.0.2
elementType: O O O O N C C C C C C C C C C C C C C C C C H H H H H H H H H H H H H H H H H H H
charge: 0
multiplicity: 1
keywords: wb97x-d3
keywords: def2-TZVPP
keywords: def2/J RIJCOSX
keywords: DEFGRID2
keywords: scfconv7
keywords: smallprint printgap noloewdin
keywords: NOSOSCF
formula: C17H19NO4
InChI: InChI=1/C17H19NO4/c1-2-20-17(19)18-12-13-21-14-8-10-16(11-9-14)22-15-6-4-3-5-7-15/h3-11,18H,2,12-13H2,1H3
41 atoms
O  -2.11357 -0.466979 -0.158687
O  3.178526 -1.373941 1.038749
O  -4.253048 2.95862 0.215253
O  -4.742629 0.932369 1.074227
N  -4.184642 1.199409 -1.115484
C  -2.662008 -0.71452 -1.438281
C  -4.0872 -0.200279 -1.442842
C  -0.803111 -0.714443 0.049802
C  1.88211 -1.142836 0.657699
C  -0.254448 -0.206594 1.226469
C  0.006536 -1.440345 -0.81841
C  1.079853 -0.412701 1.524789
C  1.342773 -1.660826 -0.508343
C  4.192118 -1.298042 0.127452
C  -4.408613 1.63342 0.13984
C  5.267715 -2.155748 0.319601
C  4.201249 -0.379917 -0.916783
C  -4.474498 3.589802 1.48105
C  6.355379 -2.095312 -0.538679
C  5.291567 -0.339572 -1.774171
C  6.371325 -1.19298 -1.593343
C  -3.292093 3.452777 2.412332
H  -2.072482 -0.208099 -2.21164
H  -2.670351 -1.785085 -1.671288
H  -4.500088 -0.365224 -2.438895
H  -4.70109 -0.773598 -0.749822
H  -0.878384 0.361647 1.9054
H  -0.381888 -1.85868 -1.737151
H  1.49801 -0.007042 2.437605
H  1.950387 -2.24279 -1.190017
H  -3.844471 1.864462 -1.793608
H  5.250954 -2.863311 1.139423
H  3.373275 0.30133 -1.066612
H  -5.388387 3.211493 1.942443
H  -4.641692 4.63815 1.235573
H  7.190905 -2.765634 -0.382861
H  5.294519 0.373188 -2.588944
H  7.217184 -1.153903 -2.266929
H  -3.475897 4.043688 3.31091
H  -3.126428 2.422153 2.724398
H  -2.377328 3.827468 1.95157
elementType: O N C H
totalener: -1015.02703126 hartree
nucrepener: 1682.40707247 hartree
electener: -2697.43410374 hartree
oneelecener: -4723.47208986 hartree
twoeener: 2026.03798612 hartree
cpcmener: -0.03465349 hartree
kineticenergy: 1010.65032005 hartree
xcener: -97.185667614814 hartree
chargesum: 0.0000000
charge: -0.323980 -0.335273 -0.332960 -0.535322 -0.233702 0.026803 -0.040992 0.267308 0.250765 -0.194809 -0.184644 -0.221607 -0.216744 0.295613 0.509598 -0.254058 -0.199479 0.046458 -0.120096 -0.148009 -0.191684 -0.253160 0.104160 0.099382 0.105153 0.099432 0.145018 0.141381 0.143573 0.155346 0.168700 0.144137 0.155139 0.087144 0.103929 0.156791 0.158568 0.157026 0.095058 0.084121 0.085915
qa: -0.3240 -0.3353 -0.3330 -0.5353 -0.2337 0.0268 -0.0410 0.2673 0.2508 -0.1948 -0.1846 -0.2216 -0.2167 0.2956 0.5096 -0.2541 -0.1995 0.0465 -0.1201 -0.1480 -0.1917 -0.2532 0.1042 0.0994 0.1052 0.0994 0.1450 0.1414 0.1436 0.1553 0.1687 0.1441 0.1551 0.0871 0.1039 0.1568 0.1586 0.1570 0.0951 0.0841 0.0859
va: 2.0754 2.0653 2.0673 1.9667 3.1734 3.8405 3.9118 3.8348 3.7192 3.9535 3.8808 4.0306 3.9824 3.6914 4.3330 4.0026 3.9022 3.8650 3.8868 3.8964 3.9072 3.9046 0.9937 0.9938 1.0045 1.0247 1.0024 1.0063 1.0068 0.9971 1.0187 1.0092 0.9978 1.0113 0.9959 0.9893 0.9905 0.9909 1.0090 1.0154 1.0049
dispcorr: -0.016618777 hartree
energy: -1015.043650041658
dipole: -6.06176 6.30554 0.24378 7.02207 -6.40423 0.61784 -1.60258 -0.56884 -2.17142
magnitude: 2.27073 au
magnitude: 5.77173 debye
