program: Orca
programVersion: 5.0.2
elementType: O O O O N C C C C C C C C C C C C C C C C C H H H H H H H H H H H H H H H H H H H
charge: 0
multiplicity: 1
keywords: wb97x-d3
keywords: def2-TZVPP
keywords: def2/J RIJCOSX
keywords: DEFGRID2
keywords: scfconv7
keywords: smallprint printgap noloewdin
keywords: NOSOSCF
formula: C17H19NO4
InChI: InChI=1/C17H19NO4/c1-2-20-17(19)18-12-13-21-14-8-10-16(11-9-14)22-15-6-4-3-5-7-15/h3-11,18H,2,12-13H2,1H3
41 atoms
O  -2.148045 -0.489762 -0.135986
O  3.126042 -1.448484 1.095316
O  -4.114179 3.031368 0.062409
O  -4.667145 1.077076 1.041716
N  -4.157699 1.204386 -1.173803
C  -2.706023 -0.777011 -1.403128
C  -4.112551 -0.21315 -1.42956
C  -0.843059 -0.754609 0.08262
C  1.832793 -1.206019 0.70859
C  -0.053066 -1.547456 -0.744651
C  -0.27986 -0.191802 1.226746
C  1.279015 -1.778201 -0.424917
C  1.050501 -0.410117 1.534263
C  4.14315 -1.361182 0.189645
C  -4.329794 1.712252 0.062439
C  4.132729 -0.46919 -0.876974
C  5.242684 -2.181687 0.409646
C  -4.263632 3.738071 1.298218
C  5.227712 -0.417719 -1.728201
C  6.333565 -2.110539 -0.443349
C  6.330847 -1.233874 -1.519847
C  -3.062323 3.586184 2.203067
H  -2.101376 -0.326131 -2.199036
H  -2.751251 -1.856209 -1.587209
H  -4.535457 -0.411384 -2.415443
H  -4.743998 -0.729027 -0.707531
H  -0.454655 -2.009482 -1.636597
H  -0.889487 0.428585 1.87217
H  1.873234 -2.411923 -1.071633
H  1.480414 0.037747 2.421478
H  -3.805217 1.819127 -1.892105
H  3.287252 0.18478 -1.048741
H  5.241456 -2.86878 1.246884
H  -5.181891 3.433818 1.80389
H  -4.383081 4.779749 1.001276
H  5.215465 0.2753 -2.559815
H  7.186878 -2.752602 -0.266156
H  7.179038 -1.187763 -2.190039
H  -3.182673 4.240468 3.067772
H  -2.947106 2.568157 2.574038
H  -2.142149 3.876951 1.694405
elementType: O N C H
totalener: -1015.02690431 hartree
nucrepener: 1686.09504298 hartree
electener: -2701.12194728 hartree
oneelecener: -4730.84701888 hartree
twoeener: 2029.72507159 hartree
cpcmener: -0.03475165 hartree
kineticenergy: 1010.64603863 hartree
xcener: -97.184448010300 hartree
chargesum: -0.0000000
charge: -0.323729 -0.335071 -0.332581 -0.534037 -0.233836 0.025083 -0.040390 0.267300 0.242934 -0.185521 -0.193423 -0.211022 -0.219204 0.294443 0.507351 -0.196245 -0.254060 0.045641 -0.151270 -0.120473 -0.192322 -0.253996 0.104179 0.099988 0.105168 0.100199 0.142825 0.145499 0.156006 0.143588 0.168564 0.154220 0.143952 0.087901 0.104262 0.158602 0.156616 0.157021 0.095948 0.083888 0.086000
qa: -0.3237 -0.3351 -0.3326 -0.5340 -0.2338 0.0251 -0.0404 0.2673 0.2429 -0.1855 -0.1934 -0.2110 -0.2192 0.2944 0.5074 -0.1962 -0.2541 0.0456 -0.1513 -0.1205 -0.1923 -0.2540 0.1042 0.1000 0.1052 0.1002 0.1428 0.1455 0.1560 0.1436 0.1686 0.1542 0.1440 0.0879 0.1043 0.1586 0.1566 0.1570 0.0959 0.0839 0.0860
va: 2.0753 2.0642 2.0668 1.9679 3.1730 3.8411 3.9128 3.8342 3.7223 3.8791 3.9494 3.9858 4.0348 3.6935 4.3362 3.8944 3.9998 3.8646 3.8997 3.8893 3.9066 3.9031 0.9938 0.9936 1.0047 1.0237 1.0053 1.0018 0.9966 1.0066 1.0188 0.9985 1.0093 1.0108 0.9959 0.9906 0.9893 0.9909 1.0089 1.0152 1.0051
dispcorr: -0.016749183 hartree
energy: -1015.043653492211
dipole: -5.58967 5.81322 0.22355 7.20911 -6.68499 0.52412 -2.01198 -0.19202 -2.20399
magnitude: 2.27646 au
magnitude: 5.78630 debye
