program: Orca
programVersion: 5.0.2
elementType: O O O O N C C C C C C C C C C C C C C C C C H H H H H H H H H H H H H H H H H H H
charge: 0
multiplicity: 1
keywords: wb97x-d3
keywords: def2-TZVPP
keywords: def2/J RIJCOSX
keywords: DEFGRID2
keywords: scfconv7
keywords: smallprint printgap noloewdin
keywords: NOSOSCF
formula: C17H19NO4
InChI: InChI=1/C17H19NO4/c1-2-20-17(19)18-12-13-21-14-8-10-16(11-9-14)22-15-6-4-3-5-7-15/h3-11,18H,2,12-13H2,1H3
41 atoms
O  -2.335211 -0.617219 0.215481
O  2.864481 -2.399044 -0.053948
O  -3.653954 3.137248 -0.366366
O  -4.053858 1.796125 1.402638
N  -4.399283 1.093525 -0.735343
C  -3.338843 -1.128432 -0.638719
C  -4.595343 -0.303743 -0.440905
C  -1.072998 -1.080262 0.091309
C  1.58794 -1.900461 -0.018486
C  -0.103583 -0.452529 0.87503
C  -0.69615 -2.124439 -0.7460
C  1.215518 -0.862868 0.830097
C  0.634467 -2.522329 -0.803656
C  3.941439 -1.563063 -0.108441
C  -4.025343 1.985631 0.203524
C  3.923247 -0.343601 -0.776171
C  5.10655 -2.016611 0.498773
C  -3.205979 4.195043 0.486493
C  5.082037 0.419925 -0.82271
C  6.258058 -1.2472 0.434843
C  6.251574 -0.022865 -0.22037
C  -1.798596 3.978344 0.997888
H  -3.021092 -1.070617 -1.686084
H  -3.554595 -2.178825 -0.411718
H  -5.359948 -0.701783 -1.109009
H  -4.975982 -0.411326 0.57367
H  -0.393906 0.357418 1.532979
H  -1.415509 -2.645257 -1.363189
H  1.946887 -0.371358 1.459864
H  0.921734 -3.334762 -1.459492
H  -4.263627 1.346914 -1.7026
H  3.022834 0.011615 -1.26152
H  5.106615 -2.969895 1.012896
H  -3.90782 4.3461 1.309204
H  -3.244662 5.082945 -0.143915
H  5.067165 1.369268 -1.342778
H  7.162996 -1.606615 0.907986
H  7.150236 0.578253 -0.264113
H  -1.105684 3.777754 0.179597
H  -1.459703 4.882878 1.504619
H  -1.738431 3.158241 1.712119
elementType: O N C H
totalener: -1015.02707591 hartree
nucrepener: 1694.06233079 hartree
electener: -2709.08940670 hartree
oneelecener: -4746.81066818 hartree
twoeener: 2037.72126148 hartree
cpcmener: -0.03452586 hartree
kineticenergy: 1010.63709509 hartree
xcener: -97.182756417602 hartree
chargesum: -0.0000000
charge: -0.321085 -0.333887 -0.332476 -0.530893 -0.235770 0.023663 -0.036130 0.290586 0.254234 -0.225012 -0.174844 -0.170775 -0.274808 0.295714 0.505781 -0.199916 -0.254886 0.044194 -0.148731 -0.121005 -0.191270 -0.254942 0.098196 0.103555 0.103981 0.101007 0.144856 0.140746 0.155843 0.144716 0.168021 0.154979 0.144109 0.088637 0.104104 0.158397 0.156767 0.156734 0.085322 0.096613 0.085672
qa: -0.3211 -0.3339 -0.3325 -0.5309 -0.2358 0.0237 -0.0361 0.2906 0.2542 -0.2250 -0.1748 -0.1708 -0.2748 0.2957 0.5058 -0.1999 -0.2549 0.0442 -0.1487 -0.1210 -0.1913 -0.2549 0.0982 0.1036 0.1040 0.1010 0.1449 0.1407 0.1558 0.1447 0.1680 0.1550 0.1441 0.0886 0.1041 0.1584 0.1568 0.1567 0.0853 0.0966 0.0857
va: 2.0796 2.0640 2.0652 1.9724 3.1747 3.8373 3.9126 3.8177 3.7184 3.9757 3.8586 3.9500 4.0706 3.6893 4.3391 3.9012 3.9996 3.8669 3.8988 3.8882 3.9053 3.8984 0.9925 0.9960 1.0054 1.0232 1.0072 1.0069 0.9956 1.0091 1.0192 0.9983 1.0095 1.0095 0.9960 0.9905 0.9894 0.9910 1.0055 1.0087 1.0152
dispcorr: -0.016774503 hartree
energy: -1015.043850411478
dipole: -4.03490 3.72605 -0.30885 9.31234 -9.09385 0.21849 -0.88463 -0.90784 -1.79248
magnitude: 1.83197 au
magnitude: 4.65649 debye
