program: Orca
programVersion: 5.0.2
elementType: O O O O N C C C C C C C C C C C C C C C C C H H H H H H H H H H H H H H H H H H H
charge: 0
multiplicity: 1
keywords: wb97x-d3
keywords: def2-TZVPP
keywords: def2/J RIJCOSX
keywords: DEFGRID2
keywords: scfconv7
keywords: smallprint printgap noloewdin
keywords: NOSOSCF
formula: C17H19NO4
InChI: InChI=1/C17H19NO4/c1-2-20-17(19)18-12-13-21-14-8-10-16(11-9-14)22-15-6-4-3-5-7-15/h3-11,18H,2,12-13H2,1H3
41 atoms
O  -3.137765 -2.007258 -0.396976
O  2.137913 -1.585877 1.137291
O  -0.82879 1.843485 -0.345958
O  -2.874183 2.01212 0.593932
N  -2.525939 0.768583 -1.269763
C  -4.042905 -0.92289 -0.239383
C  -3.834395 0.156254 -1.290306
C  -1.852029 -1.854978 0.016125
C  0.82468 -1.66185 0.740834
C  -0.858374 -2.378536 -0.807652
C  -1.494832 -1.2541 1.219563
C  0.474824 -2.291827 -0.445073
C  -0.156099 -1.145457 1.569951
C  3.008072 -0.811944 0.428588
C  -2.134899 1.576184 -0.267419
C  2.606406 0.162746 -0.477819
C  4.360522 -1.025922 0.676336
C  -0.251093 2.687528 0.656943
C  3.570852 0.917552 -1.134048
C  5.308613 -0.26179 0.01556
C  4.92153 0.712481 -0.896493
C  -0.398776 4.153313 0.322889
H  -5.040365 -1.345109 -0.368305
H  -4.003891 -0.50428 0.768416
H  -3.974078 -0.268025 -2.284342
H  -4.609387 0.914486 -1.160809
H  -1.13411 -2.856547 -1.739554
H  -2.242264 -0.857838 1.893995
H  1.238052 -2.704984 -1.093185
H  0.118878 -0.664958 2.50071
H  -1.816456 0.385695 -1.875212
H  1.558763 0.344947 -0.67865
H  4.662676 -1.787749 1.384381
H  0.801288 2.406238 0.680591
H  -0.673353 2.459616 1.636533
H  3.252771 1.676274 -1.837771
H  6.358787 -0.434796 0.21347
H  5.664739 1.305134 -1.413318
H  0.12056 4.746617 1.076855
H  0.045177 4.386939 -0.645337
H  -1.441429 4.470438 0.312901
elementType: O N C H
totalener: -1015.02409934 hartree
nucrepener: 1827.50411191 hartree
electener: -2842.52821125 hartree
oneelecener: -5013.00684039 hartree
twoeener: 2170.47862914 hartree
cpcmener: -0.02870253 hartree
kineticenergy: 1010.64227065 hartree
xcener: -97.185575726883 hartree
chargesum: -0.0000000
charge: -0.355489 -0.334416 -0.324715 -0.524051 -0.216701 0.027113 -0.038478 0.192946 0.268322 -0.194407 -0.091697 -0.162365 -0.288661 0.327236 0.471982 -0.228614 -0.240636 0.054863 -0.177337 -0.128242 -0.184810 -0.252884 0.110900 0.096336 0.104937 0.097396 0.140109 0.150297 0.153966 0.145649 0.179161 0.151438 0.142612 0.098777 0.091604 0.155996 0.155896 0.156588 0.095737 0.085921 0.087721
qa: -0.3555 -0.3344 -0.3247 -0.5241 -0.2167 0.0271 -0.0385 0.1929 0.2683 -0.1944 -0.0917 -0.1624 -0.2887 0.3272 0.4720 -0.2286 -0.2406 0.0549 -0.1773 -0.1282 -0.1848 -0.2529 0.1109 0.0963 0.1049 0.0974 0.1401 0.1503 0.1540 0.1456 0.1792 0.1514 0.1426 0.0988 0.0916 0.1560 0.1559 0.1566 0.0957 0.0859 0.0877
va: 2.0284 2.0717 2.0621 1.9812 3.1726 3.8304 3.8830 3.8391 3.6747 3.9767 3.6927 3.9655 3.9913 3.6551 4.3722 3.8550 3.9850 3.8191 3.9384 3.9015 3.9006 3.9475 1.0058 1.0073 1.0060 1.0175 1.0101 1.0018 0.9947 1.0073 1.0118 1.0059 1.0103 0.9914 1.0131 0.9931 0.9893 0.9906 1.0065 1.0045 1.0138
dispcorr: -0.021886520 hartree
energy: -1015.045985858381
dipole: -1.66208 1.79525 0.13317 11.68433 -11.40008 0.28425 -2.24718 1.13722 -1.10996
magnitude: 1.15349 au
magnitude: 2.93195 debye
