program: Orca
programVersion: 5.0.2
elementType: O O O O N C C C C C C C C C C C C C C C C C H H H H H H H H H H H H H H H H H H H
charge: 0
multiplicity: 1
keywords: wb97x-d3
keywords: def2-TZVPP
keywords: def2/J RIJCOSX
keywords: DEFGRID2
keywords: scfconv7
keywords: smallprint printgap noloewdin
keywords: NOSOSCF
formula: C17H19NO4
InChI: InChI=1/C17H19NO4/c1-2-20-17(19)18-12-13-21-14-8-10-16(11-9-14)22-15-6-4-3-5-7-15/h3-11,18H,2,12-13H2,1H3
41 atoms
O  -2.285668 -0.545631 0.33203
O  2.870839 -2.460224 0.381482
O  -3.663668 3.140173 -0.634993
O  -3.938002 1.991177 1.285622
N  -4.374225 1.054654 -0.743791
C  -3.311252 -1.148355 -0.431456
C  -4.557752 -0.299639 -0.284444
C  -1.041243 -1.062416 0.294555
C  1.592123 -1.961963 0.33783
C  -0.687351 -2.221766 -0.386072
C  -0.064794 -0.362063 1.005871
C  0.632793 -2.66094 -0.36879
C  1.24061 -0.810599 1.035117
C  3.915309 -1.651304 0.038526
C  -3.976776 2.050417 0.07277
C  3.800029 -0.61636 -0.883162
C  5.140916 -1.932392 0.630688
C  -3.226193 4.303057 0.0773
C  4.920779 0.140502 -1.197092
C  6.25246 -1.172119 0.300565
C  6.148912 -0.128367 -0.609451
C  -1.771642 4.221409 0.478838
H  -3.021622 -1.2106 -1.487018
H  -3.521858 -2.16516 -0.080939
H  -5.352801 -0.766671 -0.867293
H  -4.8933 -0.287704 0.751856
H  -1.415251 -2.797977 -0.941013
H  -0.340359 0.535948 1.545154
H  0.904438 -3.560093 -0.90769
H  1.981635 -0.259906 1.60157
H  -4.291592 1.200015 -1.738818
H  2.852843 -0.39571 -1.358844
H  5.219357 -2.74191 1.345905
H  -3.867139 4.485987 0.941496
H  -3.378961 5.123269 -0.623391
H  4.826998 0.946519 -1.913749
H  7.203758 -1.394551 0.766826
H  7.016547 0.467968 -0.859067
H  -1.468091 5.173847 0.915927
H  -1.589544 3.445206 1.221436
H  -1.131359 4.034202 -0.384057
elementType: O N C H
totalener: -1015.02753023 hartree
nucrepener: 1693.50579059 hartree
electener: -2708.53332082 hartree
oneelecener: -4745.73836339 hartree
twoeener: 2037.20504257 hartree
cpcmener: -0.03475634 hartree
kineticenergy: 1010.64510063 hartree
xcener: -97.183856502860 hartree
chargesum: -0.0000000
charge: -0.318208 -0.335619 -0.332757 -0.533996 -0.234768 0.022259 -0.037997 0.298646 0.223369 -0.183443 -0.231196 -0.254621 -0.153095 0.277840 0.508599 -0.183823 -0.243866 0.044597 -0.159252 -0.127776 -0.187618 -0.250231 0.100392 0.104346 0.104818 0.099845 0.141347 0.144536 0.145711 0.156459 0.168383 0.153925 0.144272 0.087827 0.104406 0.158318 0.157065 0.157493 0.094828 0.083708 0.085278
qa: -0.3182 -0.3356 -0.3328 -0.5340 -0.2348 0.0223 -0.0380 0.2986 0.2234 -0.1834 -0.2312 -0.2546 -0.1531 0.2778 0.5086 -0.1838 -0.2439 0.0446 -0.1593 -0.1278 -0.1876 -0.2502 0.1004 0.1043 0.1048 0.0998 0.1413 0.1445 0.1457 0.1565 0.1684 0.1539 0.1443 0.0878 0.1044 0.1583 0.1571 0.1575 0.0948 0.0837 0.0853
va: 2.0826 2.0587 2.0670 1.9676 3.1745 3.8377 3.9158 3.8101 3.7392 3.8605 3.9750 4.0661 3.9494 3.7034 4.3347 3.8778 3.9923 3.8650 3.9084 3.8982 3.9010 3.9068 0.9924 0.9954 1.0051 1.0239 1.0068 1.0077 1.0075 0.9946 1.0190 0.9989 1.0090 1.0113 0.9957 0.9909 0.9892 0.9906 1.0088 1.0138 1.0052
dispcorr: -0.016723097 hartree
energy: -1015.044253325078
dipole: -4.27413 3.76180 -0.51234 9.56620 -9.52483 0.04137 -2.56033 0.68718 -1.87316
magnitude: 1.94240 au
magnitude: 4.93719 debye
