program: Orca
programVersion: 5.0.2
elementType: O O O O N C C C C C C C C C C C C C C C C C H H H H H H H H H H H H H H H H H H H
charge: 0
multiplicity: 1
keywords: wb97x-d3
keywords: def2-TZVPP
keywords: def2/J RIJCOSX
keywords: DEFGRID2
keywords: scfconv7
keywords: smallprint printgap noloewdin
keywords: NOSOSCF
formula: C17H19NO4
InChI: InChI=1/C17H19NO4/c1-2-20-17(19)18-12-13-21-14-8-10-16(11-9-14)22-15-6-4-3-5-7-15/h3-11,18H,2,12-13H2,1H3
41 atoms
O  -2.142088 -0.42103 -0.545804
O  2.921204 -1.799172 1.100204
O  -4.178096 2.816327 0.746739
O  -3.799088 2.172019 -1.379663
N  -4.618845 0.728715 0.178458
C  -3.254552 -1.264929 -0.320218
C  -4.509965 -0.468752 -0.616773
C  -0.918645 -0.823267 -0.14378
C  1.672488 -1.459632 0.64255
C  -0.589638 -2.134168 0.18096
C  0.060944 0.167636 -0.066952
C  0.709814 -2.448118 0.564262
C  1.346825 -0.144705 0.327755
C  4.025772 -1.447083 0.380247
C  -4.154282 1.920562 -0.245589
C  4.014116 -1.298294 -1.001899
C  5.205144 -1.278393 1.096346
C  -3.67686 4.129703 0.476645
C  5.192473 -0.970517 -1.658611
C  6.375013 -0.959344 0.424679
C  6.375419 -0.797534 -0.9544
C  -2.1665 4.188321 0.505817
H  -3.228019 -2.146936 -0.969671
H  -3.264426 -1.614392 0.718864
H  -4.554375 -0.203548 -1.671852
H  -5.3697 -1.109712 -0.417068
H  -1.320997 -2.929657 0.130061
H  -0.197925 1.191345 -0.308076
H  0.963907 -3.471669 0.80971
H  2.089533 0.640337 0.398474
H  -4.804718 0.619354 1.16363
H  3.103072 -1.437479 -1.569829
H  5.20228 -1.398378 2.172511
H  -4.094411 4.748283 1.270225
H  -4.069761 4.502513 -0.470563
H  5.179734 -0.854058 -2.734678
H  7.290253 -0.828236 0.987611
H  7.288751 -0.541404 -1.474792
H  -1.714775 3.615419 -0.303089
H  -1.846894 5.224992 0.393733
H  -1.772116 3.820943 1.453658
elementType: O N C H
totalener: -1015.02704810 hartree
nucrepener: 1691.22403163 hartree
electener: -2706.25107973 hartree
oneelecener: -4741.18524383 hartree
twoeener: 2034.93416410 hartree
cpcmener: -0.03448040 hartree
kineticenergy: 1010.65413539 hartree
xcener: -97.185686397223 hartree
chargesum: -0.0000000
charge: -0.325209 -0.335019 -0.332323 -0.533535 -0.233144 0.024086 -0.036664 0.266311 0.240698 -0.171064 -0.201608 -0.257244 -0.174984 0.285537 0.505529 -0.189417 -0.247224 0.046265 -0.157459 -0.124857 -0.190411 -0.253747 0.099409 0.102748 0.099717 0.105107 0.143285 0.148169 0.145217 0.156189 0.168164 0.154217 0.143927 0.104664 0.086845 0.158632 0.156413 0.157298 0.082078 0.096765 0.086638
qa: -0.3252 -0.3350 -0.3323 -0.5335 -0.2331 0.0241 -0.0367 0.2663 0.2407 -0.1711 -0.2016 -0.2572 -0.1750 0.2855 0.5055 -0.1894 -0.2472 0.0463 -0.1575 -0.1249 -0.1904 -0.2537 0.0994 0.1027 0.0997 0.1051 0.1433 0.1482 0.1452 0.1562 0.1682 0.1542 0.1439 0.1047 0.0868 0.1586 0.1564 0.1573 0.0821 0.0968 0.0866
va: 2.0740 2.0603 2.0672 1.9681 3.1749 3.8435 3.9107 3.8392 3.7222 3.8634 3.9516 4.0634 3.9657 3.6969 4.3383 3.8825 3.9925 3.8646 3.9079 3.8952 3.9030 3.9028 0.9936 0.9941 1.0240 1.0050 1.0037 1.0014 1.0078 0.9957 1.0191 0.9992 1.0093 0.9960 1.0116 0.9908 0.9894 0.9906 1.0152 1.0092 1.0048
dispcorr: -0.016928506 hartree
energy: -1015.043976602690
dipole: -5.15224 4.34809 -0.80415 7.31352 -7.95925 -0.64573 -0.15228 1.14701 0.99474
magnitude: 1.43287 au
magnitude: 3.64207 debye
