program: Orca
programVersion: 5.0.2
elementType: O O O O N C C C C C C C C C C C C C C C C C H H H H H H H H H H H H H H H H H H H
charge: 0
multiplicity: 1
keywords: wb97x-d3
keywords: def2-TZVPP
keywords: def2/J RIJCOSX
keywords: DEFGRID2
keywords: scfconv7
keywords: smallprint printgap noloewdin
keywords: NOSOSCF
formula: C17H19NO4
InChI: InChI=1/C17H19NO4/c1-2-20-17(19)18-12-13-21-14-8-10-16(11-9-14)22-15-6-4-3-5-7-15/h3-11,18H,2,12-13H2,1H3
41 atoms
O  -1.832095 -0.57438 -0.12853
O  3.494095 -1.26584 1.064883
O  -4.862446 2.714883 1.030121
O  -4.435963 2.901247 -1.173771
N  -4.314217 0.899531 -0.103993
C  -2.282169 0.124086 -1.276089
C  -3.794263 0.15364 -1.223557
C  -0.506407 -0.708892 0.08419
C  2.185359 -1.098937 0.688824
C  -0.132438 -1.457298 1.199995
C  0.482427 -0.15695 -0.72531
C  1.203494 -1.658773 1.494977
C  1.823722 -0.345085 -0.415542
C  4.432829 -1.631281 0.144375
C  -4.520884 2.228139 -0.164708
C  5.729549 -1.184672 0.368579
C  4.148321 -2.448141 -0.94437
C  -5.185832 4.108166 1.107909
C  6.742341 -1.554503 -0.50327
C  5.171121 -2.800979 -1.813548
C  6.469141 -2.356665 -1.602949
C  -5.46832 4.43183 2.552956
H  -1.886993 1.145686 -1.295724
H  -1.956402 -0.382113 -2.191886
H  -4.165142 0.584102 -2.152628
H  -4.184449 -0.863774 -1.172172
H  -0.896605 -1.890371 1.833624
H  0.235746 0.43129 -1.598659
H  1.48314 -2.247066 2.360091
H  2.577678 0.106042 -1.04875
H  -4.322535 0.453578 0.800274
H  5.940373 -0.553055 1.222592
H  3.144222 -2.812816 -1.119933
H  -6.058721 4.322039 0.487139
H  -4.353525 4.70911 0.736181
H  7.750149 -1.202326 -0.324312
H  4.945604 -3.435099 -2.661334
H  7.260044 -2.63585 -2.28638
H  -5.729204 5.486859 2.638262
H  -6.305031 3.851273 2.942283
H  -4.597488 4.253029 3.184067
elementType: O N C H
totalener: -1015.02934973 hartree
nucrepener: 1634.57214870 hartree
electener: -2649.60149843 hartree
oneelecener: -4627.19397861 hartree
twoeener: 1977.59248017 hartree
cpcmener: -0.02970821 hartree
kineticenergy: 1010.64269838 hartree
xcener: -97.182853803964 hartree
chargesum: 0.0000000
charge: -0.330356 -0.335118 -0.327564 -0.538731 -0.239695 0.039532 -0.057392 0.289526 0.231956 -0.218482 -0.183416 -0.203397 -0.215251 0.291120 0.520671 -0.251616 -0.194655 0.048668 -0.122788 -0.151620 -0.191162 -0.251550 0.097490 0.112879 0.096808 0.107853 0.138813 0.140562 0.145049 0.158074 0.176319 0.144265 0.153842 0.093899 0.091601 0.156755 0.158375 0.157215 0.087449 0.087183 0.086891
qa: -0.3304 -0.3351 -0.3276 -0.5387 -0.2397 0.0395 -0.0574 0.2895 0.2320 -0.2185 -0.1834 -0.2034 -0.2153 0.2911 0.5207 -0.2516 -0.1947 0.0487 -0.1228 -0.1516 -0.1912 -0.2515 0.0975 0.1129 0.0968 0.1079 0.1388 0.1406 0.1450 0.1581 0.1763 0.1443 0.1538 0.0939 0.0916 0.1568 0.1584 0.1572 0.0874 0.0872 0.0869
va: 2.0627 2.0635 2.0704 1.9676 3.1725 3.7798 3.9496 3.8058 3.7375 3.9902 3.8534 4.0215 3.9847 3.6956 4.3018 3.9981 3.8906 3.8454 3.8903 3.9005 3.9043 3.9740 0.9956 0.9970 1.0241 1.0063 1.0099 1.0106 1.0048 0.9961 1.0194 1.0091 0.9989 0.9958 0.9978 0.9893 0.9907 0.9907 1.0069 1.0029 1.0034
dispcorr: -0.015531160 hartree
energy: -1015.044880890392
dipole: -10.82637 10.50597 -0.32040 8.44534 -8.90840 -0.46306 0.38722 -0.35357 0.03365
magnitude: 0.56410 au
magnitude: 1.43383 debye
