program: Orca
programVersion: 5.0.2
elementType: O O O O N C C C C C C C C C C C C C C C C C H H H H H H H H H H H H H H H H H H H
charge: 0
multiplicity: 1
keywords: wb97x-d3
keywords: def2-TZVPP
keywords: def2/J RIJCOSX
keywords: DEFGRID2
keywords: scfconv7
keywords: smallprint printgap noloewdin
keywords: NOSOSCF
formula: C17H19NO4
InChI: InChI=1/C17H19NO4/c1-2-20-17(19)18-12-13-21-14-8-10-16(11-9-14)22-15-6-4-3-5-7-15/h3-11,18H,2,12-13H2,1H3
41 atoms
O  -2.208996 -0.904244 0.06455
O  2.88731 -2.594536 -1.165404
O  -4.097665 3.31054 -0.115229
O  -4.452367 2.451734 1.936603
N  -2.588198 1.941335 0.740851
C  -2.59749 -0.453072 1.351975
C  -2.084154 0.945113 1.654326
C  -0.930393 -1.290495 -0.153202
C  1.644996 -2.131708 -0.809684
C  -0.56905 -1.497803 -1.483707
C  0.01438 -1.51286 0.846171
C  0.711249 -1.909507 -1.811194
C  1.293168 -1.93874 0.516232
C  3.99962 -1.961292 -0.689494
C  -3.770846 2.554327 0.934617
C  4.040829 -0.592287 -0.448315
C  5.129117 -2.745412 -0.487785
C  -5.307842 4.071694 -0.028735
C  5.220567 -0.018563 0.004699
C  6.302748 -2.15587 -0.042167
C  6.354611 -0.791772 0.211906
C  -5.504862 4.770008 -1.35066
H  -3.688214 -0.451686 1.339451
H  -2.289099 -1.150754 2.136517
H  -2.368733 1.205492 2.673381
H  -0.994637 0.978496 1.621549
H  -1.29691 -1.327037 -2.267461
H  -0.219162 -1.371675 1.892362
H  0.981651 -2.060915 -2.848823
H  2.009933 -2.116688 1.308505
H  -2.147399 2.02213 -0.162068
H  3.16871 0.028272 -0.611548
H  5.085737 -3.810371 -0.680038
H  -5.231771 4.798782 0.783833
H  -6.152952 3.413717 0.186472
H  5.249084 1.047272 0.192189
H  7.178929 -2.772043 0.114233
H  7.269397 -0.335806 0.567093
H  -5.62141 4.058908 -2.169377
H  -6.411323 5.373837 -1.303345
H  -4.673903 5.436641 -1.584739
elementType: O N C H
totalener: -1015.02697781 hartree
nucrepener: 1657.28121607 hartree
electener: -2672.30819388 hartree
oneelecener: -4672.25148623 hartree
twoeener: 1999.94329235 hartree
cpcmener: -0.03088259 hartree
kineticenergy: 1010.63413875 hartree
xcener: -97.182264635147 hartree
chargesum: -0.0000000
charge: -0.343940 -0.336812 -0.327915 -0.538216 -0.233491 0.033183 -0.073369 0.298076 0.209958 -0.215160 -0.213028 -0.195161 -0.184698 0.270047 0.519856 -0.177230 -0.239311 0.048252 -0.159174 -0.128433 -0.186221 -0.252079 0.117152 0.100733 0.100913 0.127172 0.138228 0.142524 0.145526 0.158667 0.175699 0.153761 0.144409 0.094518 0.091461 0.158539 0.156897 0.157126 0.087164 0.087474 0.086903
qa: -0.3439 -0.3368 -0.3279 -0.5382 -0.2335 0.0332 -0.0734 0.2981 0.2100 -0.2152 -0.2130 -0.1952 -0.1847 0.2700 0.5199 -0.1772 -0.2393 0.0483 -0.1592 -0.1284 -0.1862 -0.2521 0.1172 0.1007 0.1009 0.1272 0.1382 0.1425 0.1455 0.1587 0.1757 0.1538 0.1444 0.0945 0.0915 0.1585 0.1569 0.1571 0.0872 0.0875 0.0869
va: 2.0514 2.0581 2.0701 1.9686 3.1534 3.8536 3.8677 3.7740 3.7562 4.0021 3.8499 4.0183 3.9511 3.7095 4.3060 3.8760 3.9909 3.8446 3.9058 3.8964 3.9000 3.9736 1.0037 1.0021 1.0281 0.9997 1.0109 1.0071 1.0038 0.9951 1.0179 0.9989 1.0087 0.9955 0.9979 0.9908 0.9893 0.9906 1.0033 1.0068 1.0032
dispcorr: -0.016315275 hartree
energy: -1015.043293080595
dipole: -9.36345 9.93666 0.57321 12.41664 -11.78673 0.62991 1.03076 -1.14193 -0.11117
magnitude: 0.85891 au
magnitude: 2.18316 debye
