program: Orca
programVersion: 5.0.2
elementType: O O O O N C C C C C C C C C C C C C C C C C H H H H H H H H H H H H H H H H H H H
charge: 0
multiplicity: 1
keywords: wb97x-d3
keywords: def2-TZVPP
keywords: def2/J RIJCOSX
keywords: DEFGRID2
keywords: scfconv7
keywords: smallprint printgap noloewdin
keywords: NOSOSCF
formula: C17H19NO4
InChI: InChI=1/C17H19NO4/c1-2-20-17(19)18-12-13-21-14-8-10-16(11-9-14)22-15-6-4-3-5-7-15/h3-11,18H,2,12-13H2,1H3
41 atoms
O  -2.112499 -0.823884 0.408389
O  3.099519 -2.575676 0.708741
O  -4.220095 3.303678 0.690787
O  -4.833952 2.351502 -1.256735
N  -2.797372 1.953069 -0.328907
C  -2.762696 -0.469007 -0.801147
C  -2.394663 0.930337 -1.263198
C  -0.816969 -1.211964 0.38957
C  1.826764 -2.080379 0.574654
C  -0.217428 -1.403384 1.633846
C  -0.071658 -1.451735 -0.762536
C  1.09626 -1.827942 1.726625
C  1.241386 -1.892894 -0.666456
C  4.132903 -1.99381 0.033474
C  -4.01912 2.516401 -0.368753
C  4.168156 -0.638166 -0.273466
C  5.197874 -2.819934 -0.305966
C  -5.440095 4.053778 0.732152
C  5.275274 -0.120376 -0.93176
C  6.300124 -2.285795 -0.955865
C  6.343632 -0.935859 -1.277952
C  -5.483892 4.78791 2.048784
H  -2.570606 -1.197762 -1.594245
H  -3.830042 -0.514852 -0.580212
H  -1.319289 1.019195 -1.424313
H  -2.866345 1.112467 -2.228672
H  -0.787396 -1.214729 2.535237
H  -0.489004 -1.316524 -1.750751
H  1.550203 -1.971862 2.699214
H  1.797278 -2.090853 -1.574741
H  -2.225587 2.101399 0.488401
H  3.348903 0.015822 -0.003018
H  5.160622 -3.873812 -0.059394
H  -6.298254 3.384926 0.638495
H  -5.469603 4.757728 -0.103198
H  5.29895 0.935165 -1.170939
H  7.12636 -2.934344 -1.217672
H  7.201979 -0.523743 -1.791893
H  -4.635614 5.46341 2.165076
H  -6.393505 5.387379 2.092699
H  -5.498886 4.099171 2.894099
elementType: O N C H
totalener: -1015.02693131 hartree
nucrepener: 1649.86860307 hartree
electener: -2664.89553439 hartree
oneelecener: -4657.44227062 hartree
twoeener: 1992.54673623 hartree
cpcmener: -0.03081382 hartree
kineticenergy: 1010.63162367 hartree
xcener: -97.181816366254 hartree
chargesum: 0.0000000
charge: -0.341701 -0.335144 -0.328569 -0.538260 -0.233962 0.033448 -0.068569 0.296301 0.216176 -0.215858 -0.202262 -0.198306 -0.196062 0.281173 0.519229 -0.184814 -0.246653 0.048108 -0.156299 -0.124172 -0.189883 -0.251251 0.100702 0.117010 0.124405 0.100420 0.138186 0.141467 0.145188 0.157999 0.175781 0.152739 0.144105 0.090399 0.095133 0.158512 0.156784 0.157047 0.086812 0.087279 0.087358
qa: -0.3417 -0.3351 -0.3286 -0.5383 -0.2340 0.0334 -0.0686 0.2963 0.2162 -0.2159 -0.2023 -0.1983 -0.1961 0.2812 0.5192 -0.1848 -0.2467 0.0481 -0.1563 -0.1242 -0.1899 -0.2513 0.1007 0.1170 0.1244 0.1004 0.1382 0.1415 0.1452 0.1580 0.1758 0.1527 0.1441 0.0904 0.0951 0.1585 0.1568 0.1570 0.0868 0.0873 0.0874
va: 2.0549 2.0606 2.0696 1.9685 3.1552 3.8597 3.8660 3.7812 3.7493 3.9995 3.8483 4.0225 3.9640 3.7028 4.3072 3.8822 3.9937 3.8458 3.9046 3.8927 3.9024 3.9733 1.0022 1.0029 1.0004 1.0288 1.0109 1.0078 1.0042 0.9956 1.0184 0.9997 1.0091 0.9983 0.9952 0.9907 0.9893 0.9908 1.0032 1.0069 1.0031
dispcorr: -0.016160102 hartree
energy: -1015.043091416215
dipole: -9.97088 10.50905 0.53817 12.25749 -11.59877 0.65872 0.10248 -0.09333 0.00915
magnitude: 0.85066 au
magnitude: 2.16220 debye
